{"text_format":"1","workbook":"xlsx","n_sheets":8,"sheets":["DADOS","BDI (1)","BDI (2)","BDI (3)","BDI (4)","PO","PLQ","CFF"],"not_rendered":{"charts":0,"images":9,"macros":1,"external_links":0,"defined_names":125,"comments":0,"pivot_tables":0},"unopened":[],"bounds":{"document_bytes":16777216,"sheet_cells":100000,"rows_first":2000,"rows_last":500,"rows_between":2000,"halvings":0,"cell_chars":16384,"cell_head_chars":4096},"cells_cut":0,"cells_raw":0,"read":"whole","date_system":"1900"}

{"sheet":"DADOS","index":0,"n_rows":230,"n_cols":24,"rows_kept":230,"cut":false,"hidden":false,"merged":[[37,6,37,18],[85,0,85,23],[37,3,37,5],[41,2,41,6],[67,0,67,23],[77,0,77,23],[70,0,70,23],[71,0,71,23],[15,0,15,23],[17,0,17,23],[21,0,21,8],[75,0,75,23],[83,0,83,23],[76,0,76,23],[78,0,78,23],[81,0,81,23],[219,9,219,14],[98,0,98,23],[97,0,97,23],[96,0,96,23],[25,0,25,23],[27,0,27,1],[28,0,28,1],[68,0,68,23],[59,0,59,23],[61,0,61,23],[100,0,100,23],[94,0,94,23],[95,0,95,23],[37,0,37,1],[41,20,41,21],[69,0,69,23],[39,0,39,23],[99,0,99,23],[73,0,73,23],[80,0,80,23],[89,0,89,23],[92,0,92,23],[93,0,93,23],[91,0,91,23],[0,1,1,23],[55,7,55,10],[41,22,41,23],[36,0,36,1],[41,0,41,1],[42,22,42,23],[42,14,42,19],[42,2,42,6],[41,10,41,12],[42,20,42,21],[34,0,34,23],[36,6,36,18],[36,3,36,5],[3,0,3,23],[5,0,5,23],[7,0,7,23],[23,0,23,23],[13,0,13,23],[9,0,9,23],[11,0,11,23],[41,7,41,8],[55,1,55,4],[41,14,41,19],[42,0,42,1],[223,0,223,5],[223,6,223,9],[222,6,222,9],[219,2,219,4],[86,0,86,23],[228,22,228,23],[228,20,228,21],[42,7,42,8],[226,0,226,1],[225,6,225,18],[225,0,225,1],[219,0,219,1],[226,3,226,5],[47,0,47,2],[56,7,56,10],[53,1,53,4],[64,0,64,23],[54,7,54,10],[44,0,44,23],[62,0,62,23],[49,0,49,23],[54,1,54,4],[56,1,56,4],[53,7,53,10],[229,14,229,19],[228,7,228,8],[228,10,228,12],[228,14,228,19],[229,22,229,23],[223,16,223,23],[222,10,222,15],[79,0,79,23],[82,0,82,23],[229,0,229,1],[229,20,229,21],[229,10,229,12],[220,9,220,14],[226,6,226,18],[228,0,228,1],[228,2,228,6],[229,2,229,6],[229,7,229,8],[223,10,223,15],[222,16,222,23],[225,3,225,5],[84,0,84,23],[220,0,220,1],[222,0,222,5],[220,2,220,4],[219,5,219,8],[220,5,220,8],[219,15,219,23],[220,15,220,23],[27,9,27,14],[31,6,31,9],[30,10,30,15],[31,10,31,15],[27,15,27,23],[30,16,30,23],[31,16,31,23],[30,0,30,5],[27,2,27,4],[28,2,28,4],[27,5,27,8],[28,5,28,8],[31,0,31,5],[30,6,30,9],[28,15,28,23],[28,9,28,14],[66,0,66,23],[87,0,87,23],[42,10,42,12]]}
[27476,"PO - Planilha Orçamentária / PLQ - Planilha de Levantamento de Quantidades / CFF - Cronograma Físico Financeiro"]
["v008"]
[]
["INSTRUÇÕES DE USO E PREENCHIMENTO"]
[]
["1. Este documento somente pode ser utilizado nas versões do Excel 2003 ou superior. Não deve ser utilizado versões do BROffice. O Documento deve ser salvo SOMENTE em extensão habilitada para macros (.xls ou .xlsm). Se o documento for salvo na extensão .xlsx, o arquivo será INUTILIZADO. "]
[]
["2. Para funcionamento pleno desse arquivo, a Segurança de Macros do Excel deve ser habilitada."]
[]
["2.1  Na Versão Excel 2003, selecione na Faixa de Opções: Ferramentas --> Macro --> Segurança --> Na aba Nível de Segurança selecione a Opção \"Baixo\" --> Clique em OK --> Feche e abra o Excel novamente para utilizar a Planilha."]
[]
["2.2 Na Versão Excel 2007 ou superior, selecione na Faixa de Opções: Arquivo --> Opções --> Central de Confiabilidade --> Configurações da Central de Confiabilidade --> Configurações de Macro --> Habilitar todas as Macros --> Clique em OK --> Feche e abra o excel novamente para utilizar a Planilha."]
[]
["3. O Preenchimento deve ser feito somente nas células em amarelo. As outras células são de preenchimento Automático."]
[]
["4. Preferências de Elaboração do Orçamento"]
[]
["4.1. Preenchimento de Quantidades"]
[]
[]
[]
["5. Ordem de Preenchimento"]
[]
["5.1. na Aba DADOS"]
[]
["5.1.1. Preencha no Quadro abaixo os Dados do TC/CR:"]
[]
["Nº OPERAÇÃO",null,"GESTOR",null,null,"PROGRAMA",null,null,null,"AÇÃO / MODALIDADE",null,null,null,null,null,"OBJETO"]
["-",null,"-",null,null,"-",null,null,null,"EMPREITADA GLOBAL",null,null,null,null,null,"REFORMA DA CÂMARA DE VEREADORES DE SÃO JOSÉ DO OURO"]
[]
["PROPONENTE / TOMADOR",null,null,null,null,null,"MUNICÍPIO / UF",null,null,null,"LOCALIDADE / ENDEREÇO",null,null,null,null,null,"APELIDO DO EMPREENDIMENTO"]
["CÂMARA DE VEREADORES DE SÃO JOSÉ DO OURO",null,null,null,null,null,"SÃO JOSÉ DO OURO / RS",null,null,null,"REFORMA DA CÂMARA DE VEREADORES DE SÃO JOSÉ DO OURO",null,null,null,null,null,"REFORMA DA CÂMARA DE VEREADORES DE SÃO JOSÉ DO OURO"]
[]
[]
["5.1.2. Preencha no quadro abaixo as informações sobre o orçamento:"]
[]
["DATA BASE",null,"DESON.","LOCALIDADE DO SINAPI",null,null,"DESCRIÇÃO DO LOTE",null,null,null,null,null,null,null,null,null,null,null,null,"BDI 1","BDI 2","BDI 3","BDI 4","BDI 5"]
["2025-09-01",null,"Sim","Porto Alegre / RS",null,null,"REFORMA DA CÂMARA DE VEREADORES DE SÃO JOSÉ DO OURO",null,null,null,null,null,null,null,null,null,null,null,null,{"$f":"IF(ISERROR(INDIRECT(\"'BDI (\"&RIGHT(T37,1)&\")'!N27\")),\"\",INDIRECT(\"'BDI (\"&RIGHT(T37,1)&\")'!N27\"))","v":0.30209999999999998},{"$f":"IF(ISERROR(INDIRECT(\"'BDI (\"&RIGHT(U37,1)&\")'!N27\")),\"\",INDIRECT(\"'BDI (\"&RIGHT(U37,1)&\")'!N27\"))","v":0},{"$f":"IF(ISERROR(INDIRECT(\"'BDI (\"&RIGHT(V37,1)&\")'!N27\")),\"\",INDIRECT(\"'BDI (\"&RIGHT(V37,1)&\")'!N27\"))","v":0},{"$f":"IF(ISERROR(INDIRECT(\"'BDI (\"&RIGHT(W37,1)&\")'!N27\")),\"\",INDIRECT(\"'BDI (\"&RIGHT(W37,1)&\")'!N27\"))","v":0},{"$f":"IF(ISERROR(INDIRECT(\"'BDI (\"&RIGHT(X37,1)&\")'!N27\")),\"\",INDIRECT(\"'BDI (\"&RIGHT(X37,1)&\")'!N27\"))","v":""}]
[]
["4.1.2. Preencha no quadro abaixo as informações sobre o orçamento licitado:"]
[]
["CTEF n.º",null,"NOME DA EMPRESA ",null,null,null,null,"DATA BASE",null,"DESON.","REGIME DE EXECUÇÃO",null,null,"ACOMP.","OBJETO CTEF",null,null,null,null,null,"DATA ASSINATURA",null,"VIGÊNCIA"]
[]
[]
["5.1.3. Preencha a data de Início da Obra:"]
[]
["DATA INÍCIO"]
["2025-11-30"]
[]
["5.1.4. Preencha no(s) Quadro(s) abaixo os Dados do(s) Responsável(is) Técnico(s) pela elaboração do Orçamento:"]
[]
[null,null,null,null,null,null,"Exibir o 2° Quadro de Assinatura?",null,null,null,"NÃO"]
[]
["Nome:","LEONARDO CONSORTE",null,null,null,null,"Nome:","MONICA RAFAELA STANGUERLIN"]
[{"$f":"IF(OR(TipoOrçamento=\"BASE\",TipoOrçamento=\"REPROGRAMADONPL\"),\"Título:\",\"Cargo:\")","v":"Título:"},"ENG. CIVIL",null,null,null,null,{"$f":"A55","v":"Título:"},"ENG. CIVIL"]
[{"$f":"IF(OR(TipoOrçamento=\"BASE\",TipoOrçamento=\"REPROGRAMADONPL\"),\"CREA/CAU:\",\"Empresa:\")","v":"CREA/CAU:"},"1331921",null,null,null,null,{"$f":"A56","v":"CREA/CAU:"},"173754-5"]
[{"$f":"IF(OR(TipoOrçamento=\"BASE\",TipoOrçamento=\"REPROGRAMADONPL\"),\"ART/RRT:\",\"CNPJ:\")","v":"ART/RRT:"},"13901876",null,null,null,null,{"$f":"A57","v":"ART/RRT:"},"***"]
[]
[]
["5.2. Legenda das Abas"]
[]
["5.2.1.  LARANJA: Aba DADOS. Preenchimento Obrigatório. Impressão Dispensada."]
["5.2.2.  AMARELO: Abas BDI, PO, PLQ e CFF. Preenchimento e Impressão Obrigatórias. O preenchimento da Aba BDI é dispensada para os casos de Aquisição Direta de Materiais e Equipamentos. A Impressão da Aba PLQ pode ser dispensada para casos de Frente de Obra Única."]
[]
["5.3. na Aba BDI (Bonificações e Despesas Indiretas):"]
[]
["5.3.1. Escolha o tipo de empreendimento."]
["5.3.2. Escolha se o BDI será do tipo desonerado ou não (aba DADOS)"]
["5.3.3. Informe a base de cálculo do ISS (0 a 100%)."]
["5.3.4. Informe a alíquota do ISS (Normalmente de 2 a 5%)."]
["5.3.5. Defina na tabela os percentuais a serem adotados para cada item que compõe o BDI nos campos em amarelo."]
["5.3.6. Preencha o campo observações se necessário (recomendado para os orçamentos que utilizam mais de um BDI)."]
[]
["5.4. na Aba PO (Planilha Orçamentária):"]
[]
["5.4.1. Primeiramente, selecione os níveis de cada item do orçamento na coluna NÍVEL."]
["5.4.1.1: O nível de \"Serviço\" serve tanto para serviços ou insumos (mão-de-obra / material / equipamento / veículo / máquina / ferramenta / etc). Um \"nível 2/3/4\" é um título (é preenchida apenas a coluna descrição) utilizado para organizar melhor a planilha orçamentária e engloba (agrupa) serviços e agrupadores de nível inferior."]
["5.4.2. Após a seleção dos níveis, preencha, para cada serviço, as informações sobre a Fonte de Referência, (SINAPI, SICRO, SIURB, etc) e o respectivo Código de Referência."]
["5.4.3. Esta planilha é compatível com o arquivo REFERÊNCIA distribuído pela CAIXA. Caso o arquivo REFERÊNCIA esteja aberto, será possível buscar um código através do botão \"Buscar Código\". Desta forma a descrição dos serviços será preenchida automaticamente (podendo ser substituída). Caso contrário, seu preenchimento deve ser manual."]
["5.4.3.1. As descrições e unidades preenchidas automaticamente ficarão vinculadas ao arquivo REFERÊNCIA até que se use o botão \"Fixar Descrições\", que quebra a fórmula e transforma as descrições em texto."]
["5.4.4. Preencher o custo unitário do serviço/insumo na Coluna CUSTO UNITÁRIO. ATENÇÃO: o custo unitário adotado deve ser menor ou igual ao contido na tabela de referência ou mediana das cotações de mercado."]
["5.4.5. Indicar o BDI adotado para cada serviço/insumo na Coluna BDI. Preferencialmente selecione uma das opções da lista suspensa que aparecerá na célula, esta lista contém os 05 BDIs que podem ser preenchidos na Aba BDI (conforme item 5.2 das instruções). Caso seja necessária a adoção de mais de 05 valores diferentes de BDI, digite o percentual diretamente na célula."]
["5.4.6. Conforme selecionado no item 4.1. desta Aba, a Coluna Quantidade pode ser preenchida diretamente na PO, ou representar a soma das quantidades de cada Frente de Obra, informadas na aba PLQ (Planilha de Levantamento de Quantitativos)."]
["5.4.7. OBSERVAÇÃO: As demais colunas (Item / Quantidade / Preço Unitário / Preço Total) são de preenchimento automático. Não tente preenche-las ou alterá-las na Aba PO."]
["5.4.8. Se for necessário acrescentar ou excluir linhas da Planilha Orçamentária, utilize o Botão EDITAR PLANILHA e selecione as opções no quadro.\nATENÇÃO: quanto maior o número de linhas mais lento será o processamento dos dados, então acrescente apenas o número necessário ou um pouco a mais."]
["5.4.8.1. Evite deixar linhas em branco no corpo da Planilha Orçamentária."]
["5.4.9. Caso deseje importar os dados de outro arquivo utilize apenas a opção COLAR ESPECIAL ==> VALORES."]
["5.4.10. Clique no Botão LICITAR / REPROGRAMAR para preencher o Orçamento Licitado ou Reprogramado."]
[]
["5.5. na Aba PLQ (Planilha de Levantamento de Quantitativos):"]
[]
["5.5.1. Preencha primeiramente as Frentes de Obra."]
["5.5.1.1. Exemplos de Frentes de Obra (Rua A trecho 01 / Rua A trecho 02 / Rua B ; UH 01 / UH 02 / UH 03). "]
["5.5.2. Preencha as quantidades dos serviços por frente de obra. A soma das quantidades de todas as frentes de um determinado serviço será a quantidade exibida na Planilha Orçamentária."]
["5.5.3. Caso deseje incluir ou excluir frentes, utilize os botões ADICIONAR e EXCLUIR."]
[]
["5.6. na Aba CFF (Cronograma Físico-Financeiro):"]
[]
["5.6.1. Preencha a data de início da obra na aba Dados."]
["5.6.2. Preencha as porcentagens previstas por parcela para cada meta ou macrosserviço."]
["5.6.3. Para atualizar o Cronograma conforme o Orçamento e incluir ou excluir parcelas, utilize o botão EDITAR / ATUALIZAR CRONOGRAMA."]
[]
[]
[]
[]
[]
[null,null,null,null,null,null,null,null,null,null,null,"(Selecione uma Localidade)"]
[null,null,null,null,null,null,null,null,null,null,null,"Aracaju / SE",null,null,null,null,null,null,{"$f":"T38","v":0.30209999999999998}]
[null,null,null,null,null,null,null,null,null,null,null,"Belém / PA",null,null,null,null,null,null,{"$f":"U38","v":0}]
[null,null,null,null,null,null,null,null,null,null,null,"Belo Horizonte / MG",null,null,null,null,null,null,{"$f":"V38","v":0}]
[null,null,null,null,null,null,null,null,null,null,null,"Boa Vista / RR",null,null,null,null,null,null,{"$f":"W38","v":0}]
[null,null,null,null,null,null,null,null,null,null,null,"Brasília / DF",null,null,null,null,null,null,{"$f":"X38","v":""}]
[null,null,null,null,null,null,null,null,null,null,null,"Campo Grande / MS"]
[null,null,null,null,null,null,null,null,null,null,null,"Cuiabá / MT"]
[null,null,null,null,null,null,null,null,null,null,null,"Curitiba / PR",null,null,null,"Empreitada Preço Global"]
[null,null,null,null,null,null,null,null,null,null,null,"Florianópolis / SC",null,null,null,"Empreitada Preço Unitário"]
[null,null,null,null,null,null,null,null,null,null,null,"Fortaleza / CE",null,null,null,"Empreitada Integral"]
[null,null,null,null,null,null,null,null,null,null,null,"Goiânia / GO",null,null,null,"Tarefa"]
[null,null,null,null,null,null,null,null,null,null,null,"João Pessoa / PB",null,null,null,"Contratação Integrada"]
[null,null,null,null,null,null,null,null,null,null,null,"Macapá / AP",null,null,null,"Não se aplica"]
[null,null,null,null,null,null,null,null,null,null,null,"Maceió / AL"]
[null,null,null,null,null,null,null,null,null,null,null,"Manaus / AM",null,null,null,"BM"]
[null,null,null,null,null,null,null,null,null,null,null,"Natal / RN",null,null,null,"PLE"]
[null,null,null,null,null,null,null,null,null,null,null,"Palmas / TO"]
[null,null,null,null,null,null,null,null,null,null,null,"Porto Alegre / RS"]
[null,null,null,null,null,null,null,null,null,null,null,"Porto Velho / RO"]
[null,null,null,null,null,null,null,null,null,null,null,"Recife / PE"]
[null,null,null,null,null,null,null,null,null,null,null,"Rio Branco / AC"]
[null,null,null,null,null,null,null,null,null,null,null,"Rio de Janeiro / RJ"]
[null,null,null,null,null,null,null,null,null,null,null,"Salvador / BA"]
[null,null,null,null,null,null,null,null,null,null,null,"São Luís / MA"]
[null,null,null,null,null,null,null,null,null,null,null,"São Paulo / SP"]
[null,null,null,null,null,null,null,null,null,null,null,"Teresina / PI"]
[null,null,null,null,null,null,null,null,null,null,null,"Vitória / ES"]
[]
[]
[]
[]
[]
[]
[]
[]
[]
[]
[]
[]
[]
[]
[]
[]
[]
[]
[]
[]
[]
[]
[]
[]
[]
[]
[]
[]
[]
[]
[]
[]
[]
[]
[]
[]
[]
[]
[]
[]
[]
[]
[]
[]
[]
[]
[]
[]
[]
[]
[]
[]
[]
[]
[]
[]
[]
[]
[]
[]
[]
[]
[]
[]
[]
[]
[]
[]
[]
[]
[]
[]
[]
[]
[]
[]
[]
[]
[]
[]
[]
[]
[]
[]
[]
[{"$f":"A28","v":"Nº OPERAÇÃO"},null,{"$f":"C28","v":"GESTOR"},null,null,{"$f":"F28","v":"PROGRAMA"},null,null,null,{"$f":"J28","v":"AÇÃO / MODALIDADE"},null,null,null,null,null,{"$f":"P28","v":"OBJETO"}]
[{"$f":"IF(A29=\"\",\"\",A29)","v":"-"},null,{"$f":"IF(C29=\"\",\"\",C29)","v":"-"},null,null,{"$f":"IF(F29=\"\",\"\",F29)","v":"-"},null,null,null,{"$f":"IF(J29=\"\",\"\",J29)","v":"EMPREITADA GLOBAL"},null,{"$f":"IF(#REF!=\"\",\"\",#REF!)","v":{"$error":"#REF!"}},null,{"$f":"IF(#REF!=\"\",\"\",#REF!)","v":{"$error":"#REF!"}},null,{"$f":"IF(P29=\"\",\"\",P29)","v":"REFORMA DA CÂMARA DE VEREADORES DE SÃO JOSÉ DO OURO"}]
[]
[{"$f":"A31","v":"PROPONENTE / TOMADOR"},null,null,null,null,null,{"$f":"G31","v":"MUNICÍPIO / UF"},null,null,null,{"$f":"K31","v":"LOCALIDADE / ENDEREÇO"},null,null,null,null,null,{"$f":"Q31","v":"APELIDO DO EMPREENDIMENTO"}]
[{"$f":"IF(A32=\"\",\"\",A32)","v":"CÂMARA DE VEREADORES DE SÃO JOSÉ DO OURO"},null,null,null,null,null,{"$f":"IF(G32=\"\",\"\",G32)","v":"SÃO JOSÉ DO OURO / RS"},{"$f":"IF(I32=\"\",\"\",I32)","v":""},null,{"$f":"IF(#REF!=\"\",\"\",#REF!)","v":{"$error":"#REF!"}},{"$f":"IF(K32=\"\",\"\",K32)","v":"REFORMA DA CÂMARA DE VEREADORES DE SÃO JOSÉ DO OURO"},null,null,null,null,null,{"$f":"IF(Q32=\"\",\"\",Q32)","v":"REFORMA DA CÂMARA DE VEREADORES DE SÃO JOSÉ DO OURO"}]
[]
[{"$f":"A37","v":"DATA BASE"},null,{"$f":"C37","v":"DESON."},{"$f":"D37","v":"LOCALIDADE DO SINAPI"},null,null,{"$f":"G37","v":"DESCRIÇÃO DO LOTE"},null,null,null,null,null,null,null,null,null,null,null,null,{"$f":"T37","v":"BDI 1"},{"$f":"U37","v":"BDI 2"},{"$f":"V37","v":"BDI 3"},{"$f":"W37","v":"BDI 4"},{"$f":"X37","v":"BDI 5"}]
[{"$f":"IF(A38=\"\",\"\",A38)","v":"2025-09-01"},null,{"$f":"IF(C38=\"\",\"\",C38)","v":"Sim"},"Porto Alegre / RS","","","REFORMA DA CÂMARA DE VEREADORES DE SÃO JOSÉ DO OURO","","","","","","","","","","","","",0.30209999999999998,0,0,0,""]
[]
["CTEF n.º",null,"NOME DA EMPRESA / CNPJ:",null,null,null,null,"DATA BASE",null,"DESON.","REGIME DE EXECUÇÃO",null,null,"ACOMP.","OBJETO CTEF",null,null,null,null,null,"DATA ASSINATURA",null,"VIGÊNCIA"]
[{"$f":"IF(A43=\"\",\"\",A43)","v":""},null,{"$f":"IF(C43=\"\",\"\",C43)","v":""},null,{"$f":"IF(E43=\"\",\"\",E43)","v":""},null,{"$f":"IF(G43=\"\",\"\",G43)","v":""},{"$f":"IF(H43=\"\",\"\",H43)","v":""},{"$f":"IF(I43=\"\",\"\",I43)","v":""},{"$f":"IF(J43=\"\",\"\",J43)","v":""},{"$f":"IF(K43=\"\",\"\",K43)","v":""},null,{"$f":"IF(M43=\"\",\"\",M43)","v":""},{"$f":"IF(N43=\"\",\"\",N43)","v":""},{"$f":"IF(O43=\"\",\"\",O43)","v":""},null,{"$f":"IF(Q43=\"\",\"\",Q43)","v":""},null,{"$f":"IF(S43=\"\",\"\",S43)","v":""},null,{"$f":"IF(U43=\"\",\"\",U43)","v":""},null,{"$f":"IF(W43=\"\",\"\",W43)","v":""}]

{"sheet":"BDI (1)","index":1,"n_rows":59,"n_cols":23,"rows_kept":59,"cut":false,"hidden":false,"merged":[[49,9,49,11],[28,9,28,17],[25,8,25,11],[26,8,26,11],[26,15,26,17],[44,14,44,17],[30,8,30,17],[34,8,34,17],[41,14,41,17],[48,9,48,11],[39,8,39,17],[45,8,45,11],[45,14,45,17],[46,9,46,11],[46,15,46,17],[47,9,47,11],[15,19,23,20],[41,8,41,11],[17,8,17,11],[18,8,18,11],[19,8,19,11],[20,8,20,11],[21,8,21,11],[22,8,22,11],[23,8,23,11],[24,8,24,11],[15,17,16,17],[36,8,36,17],[31,15,32,15],[31,12,31,14],[32,12,32,14],[31,11,32,11],[10,8,10,15],[10,16,10,17],[3,8,3,9],[3,10,3,17],[4,8,4,9],[4,10,4,17],[6,8,6,17],[7,8,7,17],[9,8,9,15],[9,16,9,17],[47,15,47,17],[44,8,44,11],[42,8,42,11],[12,16,12,17],[13,8,13,15],[13,16,13,17],[15,12,16,12],[12,8,12,15],[15,15,16,15],[15,16,16,16],[15,13,16,13],[15,8,16,11],[15,14,16,14]]}
[null,null,null,null,"MIN","MED","MAX",null,null,null,null,null,null,{"$f":"\"Quadro de Composição do BDI \"&MID(CELL(\"nome.arquivo\",N1),5+FIND(\"BDI (\",CELL(\"nome.arquivo\",N1)),1)","v":"Quadro de Composição do BDI 1"}]
["Construção e Reforma de Edifícios","AC",{"$f":"CONCATENATE(A2,\"-\",B2)","v":"Construção e Reforma de Edifícios-AC"},null,0.03,0.04,5.5E-2]
[{"$f":"A2","v":"Construção e Reforma de Edifícios"},"SG","Construção e Reforma de Edifícios-SG",null,8.0000000000000002E-3,8.0000000000000002E-3,0.01]
[{"$f":"A3","v":"Construção e Reforma de Edifícios"},"R","Construção e Reforma de Edifícios-R",null,9.7000000000000003E-3,1.2699999999999999E-2,1.2699999999999999E-2,null,"Nº TC/CR",null,"PROPONENTE / TOMADOR"]
[{"$f":"A4","v":"Construção e Reforma de Edifícios"},"DF","Construção e Reforma de Edifícios-DF",null,5.8999999999999999E-3,1.23E-2,1.3899999999999999E-2,null,{"$f":"DADOS!A29","v":"-"},null,{"$f":"DADOS!A32","v":"CÂMARA DE VEREADORES DE SÃO JOSÉ DO OURO"}]
[{"$f":"A5","v":"Construção e Reforma de Edifícios"},"L","Construção e Reforma de Edifícios-L",null,6.1600000000000002E-2,7.400000000000001E-2,8.9600000000000013E-2]
[{"$f":"A6","v":"Construção e Reforma de Edifícios"},"BDI PAD","Construção e Reforma de Edifícios-BDI PAD",null,0.2034,0.22120000000000001,0.25,null,"OBJETO"]
["Construção de Praças Urbanas, Rodovias, Ferrovias e recapeamento e pavimentação de vias urbanas","AC","Construção de Praças Urbanas, Rodovias, Ferrovias e recapeamento e pavimentação de vias urbanas-AC",null,3.7999999999999999E-2,4.0099999999999997E-2,4.6699999999999998E-2,null,{"$f":"DADOS!P29","v":"REFORMA DA CÂMARA DE VEREADORES DE SÃO JOSÉ DO OURO"}]
["Construção de Praças Urbanas, Rodovias, Ferrovias e recapeamento e pavimentação de vias urbanas","SG","Construção de Praças Urbanas, Rodovias, Ferrovias e recapeamento e pavimentação de vias urbanas-SG",null,3.2000000000000002E-3,4.0000000000000001E-3,7.4000000000000003E-3]
["Construção de Praças Urbanas, Rodovias, Ferrovias e recapeamento e pavimentação de vias urbanas","R","Construção de Praças Urbanas, Rodovias, Ferrovias e recapeamento e pavimentação de vias urbanas-R",null,5.0000000000000001E-3,5.6000000000000008E-3,9.7000000000000003E-3,null,"TIPO DE OBRA DO EMPREENDIMENTO",null,null,null,null,null,null,null,"DESONERAÇÃO"]
["Construção de Praças Urbanas, Rodovias, Ferrovias e recapeamento e pavimentação de vias urbanas","DF","Construção de Praças Urbanas, Rodovias, Ferrovias e recapeamento e pavimentação de vias urbanas-DF",null,1.0200000000000001E-2,1.11E-2,1.21E-2,null,"Construção e Reforma de Edifícios",null,null,null,null,null,null,null,{"$f":"DADOS!$C$38","v":"Sim"}]
["Construção de Praças Urbanas, Rodovias, Ferrovias e recapeamento e pavimentação de vias urbanas","L","Construção de Praças Urbanas, Rodovias, Ferrovias e recapeamento e pavimentação de vias urbanas-L",null,6.6400000000000001E-2,7.2999999999999995E-2,8.6899999999999991E-2]
["Construção de Praças Urbanas, Rodovias, Ferrovias e recapeamento e pavimentação de vias urbanas","BDI PAD","Construção de Praças Urbanas, Rodovias, Ferrovias e recapeamento e pavimentação de vias urbanas-BDI PAD",null,0.19600000000000001,0.2097,0.24230000000000002,null,"Conforme legislação tributária municipal, definir estimativa de percentual da base de cálculo para o ISS:",null,null,null,null,null,null,null,1]
["Construção de Redes de Abastecimento de Água, Coleta de Esgoto","AC","Construção de Redes de Abastecimento de Água, Coleta de Esgoto-AC",null,3.4300000000000004E-2,4.9299999999999997E-2,6.7099999999999993E-2,null,"Sobre a base de cálculo, definir a respectiva alíquota do ISS (entre 2% e 5%):",null,null,null,null,null,null,null,0.02]
[{"$f":"A14","v":"Construção de Redes de Abastecimento de Água, Coleta de Esgoto"},"SG","Construção de Redes de Abastecimento de Água, Coleta de Esgoto-SG",null,2.8000000000000004E-3,4.8999999999999998E-3,7.4999999999999997E-3]
[null,null,null,null,null,null,null,null,"Itens",null,null,null,"Siglas","% Adotado","Situação","1º Quartil","Médio","3º Quartil",null,{"$f":"IF(V27,\"Para BDI fora do intervalo estatístico, deve ser apresentado Relatório Técnico Circunstanciado justificando a adoção do percentual de cada parcela do BDI.\",\"\")","v":""}]
[{"$f":"A15","v":"Construção de Redes de Abastecimento de Água, Coleta de Esgoto"},"R","Construção de Redes de Abastecimento de Água, Coleta de Esgoto-R",null,0.01,1.3899999999999999E-2,1.7399999999999999E-2]
[{"$f":"A17","v":"Construção de Redes de Abastecimento de Água, Coleta de Esgoto"},"DF","Construção de Redes de Abastecimento de Água, Coleta de Esgoto-DF",null,9.3999999999999986E-3,9.8999999999999991E-3,1.1699999999999999E-2,null,{"$f":"IF($I$11=$A$59,\"Encargos Sociais incidentes sobre a mão de obra\",\"Administração Central\")","v":"Administração Central"},null,null,null,{"$f":"IF($I$11=$A$59,\"K1\",\"AC\")","v":"AC"},0.04,"-",{"$f":"VLOOKUP(CONCATENATE(I$11,\"-\",M18),$C$2:$G$49,3,FALSE)","v":0.03},{"$f":"VLOOKUP(CONCATENATE(I$11,\"-\",M18),$C$2:$G$49,4,FALSE)","v":0.04},{"$f":"VLOOKUP(CONCATENATE(I$11,\"-\",M18),$C$2:$G$49,5,FALSE)","v":5.5E-2}]
[{"$f":"A18","v":"Construção de Redes de Abastecimento de Água, Coleta de Esgoto"},"L","Construção de Redes de Abastecimento de Água, Coleta de Esgoto-L",null,6.7400000000000002E-2,8.0399999999999985E-2,9.4E-2,null,{"$f":"IF($I$11=$A$59,\"Administração Central da empresa ou consultoria - overhead\",\"Seguro e Garantia\")","v":"Seguro e Garantia"},null,null,null,{"$f":"IF($I$11=$A$59,\"K2\",\"SG\")","v":"SG"},8.0000000000000002E-3,"-",{"$f":"VLOOKUP(CONCATENATE(I$11,\"-\",M19),$C$2:$G$49,3,FALSE)","v":8.0000000000000002E-3},{"$f":"VLOOKUP(CONCATENATE(I$11,\"-\",M19),$C$2:$G$49,4,FALSE)","v":8.0000000000000002E-3},{"$f":"VLOOKUP(CONCATENATE(I$11,\"-\",M19),$C$2:$G$49,5,FALSE)","v":0.01}]
[{"$f":"A19","v":"Construção de Redes de Abastecimento de Água, Coleta de Esgoto"},"BDI PAD","Construção de Redes de Abastecimento de Água, Coleta de Esgoto-BDI PAD",null,0.20760000000000001,0.24179999999999999,0.26440000000000002,null,{"$f":"IF($I$11=$A$59,\"\",\"Risco\")","v":"Risco"},null,null,null,{"$f":"IF($I$11=$A$59,\"\",\"R\")","v":"R"},1.2699999999999999E-2,"-",{"$f":"VLOOKUP(CONCATENATE(I$11,\"-\",M20),$C$2:$G$49,3,FALSE)","v":9.7000000000000003E-3},{"$f":"VLOOKUP(CONCATENATE(I$11,\"-\",M20),$C$2:$G$49,4,FALSE)","v":1.2699999999999999E-2},{"$f":"VLOOKUP(CONCATENATE(I$11,\"-\",M20),$C$2:$G$49,5,FALSE)","v":1.2699999999999999E-2}]
["Construção e Manutenção de Estações e Redes de Distribuição de Energia Elétrica","AC","Construção e Manutenção de Estações e Redes de Distribuição de Energia Elétrica-AC",null,5.2900000000000003E-2,5.9200000000000003E-2,7.9299999999999995E-2,null,{"$f":"IF($I$11=$A$59,\"\",\"Despesas Financeiras\")","v":"Despesas Financeiras"},null,null,null,{"$f":"IF($I$11=$A$59,\"\",\"DF\")","v":"DF"},1.23E-2,"-",{"$f":"VLOOKUP(CONCATENATE(I$11,\"-\",M21),$C$2:$G$49,3,FALSE)","v":5.8999999999999999E-3},{"$f":"VLOOKUP(CONCATENATE(I$11,\"-\",M21),$C$2:$G$49,4,FALSE)","v":1.23E-2},{"$f":"VLOOKUP(CONCATENATE(I$11,\"-\",M21),$C$2:$G$49,5,FALSE)","v":1.3899999999999999E-2}]
[{"$f":"A21","v":"Construção e Manutenção de Estações e Redes de Distribuição de Energia Elétrica"},"SG","Construção e Manutenção de Estações e Redes de Distribuição de Energia Elétrica-SG",null,2.5000000000000001E-3,5.1000000000000004E-3,5.6000000000000008E-3,null,{"$f":"IF($I$11=$A$59,\"Margem bruta da empresa de consultoria\",\"Lucro\")","v":"Lucro"},null,null,null,{"$f":"IF($I$11=$A$59,\"K3\",\"L\")","v":"L"},8.9599999999999999E-2,"-",{"$f":"VLOOKUP(CONCATENATE(I$11,\"-\",M22),$C$2:$G$49,3,FALSE)","v":6.1600000000000002E-2},{"$f":"VLOOKUP(CONCATENATE(I$11,\"-\",M22),$C$2:$G$49,4,FALSE)","v":7.400000000000001E-2},{"$f":"VLOOKUP(CONCATENATE(I$11,\"-\",M22),$C$2:$G$49,5,FALSE)","v":8.9600000000000013E-2}]
[{"$f":"A22","v":"Construção e Manutenção de Estações e Redes de Distribuição de Energia Elétrica"},"R","Construção e Manutenção de Estações e Redes de Distribuição de Energia Elétrica-R",null,0.01,1.4800000000000001E-2,1.9699999999999999E-2,null,"Tributos (impostos COFINS 3%, e  PIS 0,65%)",null,null,null,"CP",3.6499999999999998E-2,"-",3.6499999999999998E-2,3.6499999999999998E-2,3.6499999999999998E-2]
[{"$f":"A23","v":"Construção e Manutenção de Estações e Redes de Distribuição de Energia Elétrica"},"DF","Construção e Manutenção de Estações e Redes de Distribuição de Energia Elétrica-DF",null,1.01E-2,1.0700000000000001E-2,1.11E-2,null,"Tributos (ISS, variável de acordo com o município)",null,null,null,"ISS",{"$f":"IF($I$11<>$A$58,Q14*Q13,0)","v":0.02},"-",0,2.5000000000000001E-2,0.05]
[{"$f":"A24","v":"Construção e Manutenção de Estações e Redes de Distribuição de Energia Elétrica"},"L","Construção e Manutenção de Estações e Redes de Distribuição de Energia Elétrica-L",null,0.08,8.3100000000000007E-2,9.5100000000000004E-2,null,"Tributos (Contribuição Previdenciária sobre a Receita Bruta - 0% ou 4,5% - Desoneração)",null,null,null,"CPRB",{"$f":"IF(AND($I$11<>$A$58,Q11=\"Sim\"),4.5%,0%)","v":4.4999999999999998E-2},{"$f":"IF(AND(N25>=P25, N25<=R25), \"OK\", \"Não OK\")","v":"OK"},0,4.4999999999999998E-2,4.4999999999999998E-2]
[{"$f":"A25","v":"Construção e Manutenção de Estações e Redes de Distribuição de Energia Elétrica"},"BDI PAD","Construção e Manutenção de Estações e Redes de Distribuição de Energia Elétrica-BDI PAD",null,0.24,0.25840000000000002,0.27860000000000001,null,"BDI SEM desoneração\n(Fórmula Acórdão TCU)",null,null,null,"BDI PAD",{"$f":"IF($I$11=$A$58,0,ROUND((((1+N18+N19+N20)*(1+N21)*(1+N22)/(1-(N23+N24)))-1),4))","v":0.24},{"$f":"IF(OR($I$11=$A$59,$I$11=$A$58,AND(N26>=P26, N26<=R26)), \"OK\", \"FORA DO INTERVALO\")","v":"OK"},{"$f":"IF($I$11=$A$58,0,VLOOKUP(CONCATENATE($I$11,\"-\",$M26),$C$2:$G$49,3,FALSE))","v":0.2034},{"$f":"IF($I$11=$A$58,0,VLOOKUP(CONCATENATE($I$11,\"-\",$M26),$C$2:$G$49,4,FALSE))","v":0.22120000000000001},{"$f":"IF($I$11=$A$58,0,VLOOKUP(CONCATENATE($I$11,\"-\",$M26),$C$2:$G$49,5,FALSE))","v":0.25}]
["Obras Portuárias, Marítimas e Fluviais","AC","Obras Portuárias, Marítimas e Fluviais-AC",null,0.04,5.5199999999999999E-2,7.85E-2,null,"BDI COM desoneração",null,null,null,"BDI DES",{"$f":"IF($I$11=$A$58,0,ROUND((((1+N18+N19+N20)*(1+N21)*(1+N22)/(1-(N23+N24+N25)))-1),4))","v":0.30209999999999998},{"$f":"IF(Q11<>\"Sim\",\"\",O26)","v":"OK"},null,null,null,null,null,null,{"$f":"AND(COUNTA(N18:N23)=6,O26<>\"ok\",NOT(V29))","v":false},"pedir anexo"]
[{"$f":"A27","v":"Obras Portuárias, Marítimas e Fluviais"},"SG","Obras Portuárias, Marítimas e Fluviais-SG",null,8.1000000000000013E-3,1.2199999999999999E-2,1.9900000000000001E-2]
[{"$f":"A28","v":"Obras Portuárias, Marítimas e Fluviais"},"R","Obras Portuárias, Marítimas e Fluviais-R",null,1.46E-2,2.3199999999999998E-2,3.1600000000000003E-2,null,{"$f":"IF(V29,\"X\",\"\")","v":""},"Anexo: Relatório Técnico Circunstanciado justificando a adoção do percentual de cada parcela do BDI.",null,null,null,null,null,null,null,null,null,null,null,false,"anexo apresentado"]
[]
[null,null,null,null,null,null,null,null,"Os valores de BDI foram calculados com o emprego da fórmula:"]
[{"$f":"A29","v":"Obras Portuárias, Marítimas e Fluviais"},"DF","Obras Portuárias, Marítimas e Fluviais-DF",null,9.3999999999999986E-3,1.0200000000000001E-2,1.3300000000000001E-2,null,null,null,null,{"$f":"IF(Q11=\"Sim\",\"BDI.DES =\",\"BDI.PAD =\")","v":"BDI.DES ="},{"$f":"IF($I$11=$A$59,\"(1+K1+K2)*(1+K3)\",\"(1+AC + S + R + G)*(1 + DF)*(1+L)\")","v":"(1+AC + S + R + G)*(1 + DF)*(1+L)"},null,null," - 1"]
[{"$f":"A32","v":"Obras Portuárias, Marítimas e Fluviais"},"L","Obras Portuárias, Marítimas e Fluviais-L",null,7.1399999999999991E-2,8.4000000000000005E-2,0.1043,null,null,null,null,null,{"$f":"IF(Q11=\"Sim\",\"(1-CP-ISS-CRPB)\",\"(1-CP-ISS)\")","v":"(1-CP-ISS-CRPB)"}]
[{"$f":"A33","v":"Obras Portuárias, Marítimas e Fluviais"},"BDI PAD","Obras Portuárias, Marítimas e Fluviais-BDI PAD",null,0.22800000000000001,0.27479999999999999,0.3095]
[null,null,null,null,null,null,null,null,{"$f":"CONCATENATE(\"Declaro para os devidos fins que, conforme legislação tributária municipal, a base de cálculo para \",I11,\", é de \",Q13*100,\"%, com a respectiva alíquota de \",Q14*100,\"%.\")","v":"Declaro para os devidos fins que, conforme legislação tributária municipal, a base de cálculo para Construção e Reforma de Edifícios, é de 100%, com a respectiva alíquota de 2%."}]
[]
[null,null,null,null,null,null,null,null,{"$f":"CONCATENATE(\"Declaro para os devidos fins que o regime de Contribuição Previdenciária sobre a Receita Bruta adotado para elaboração do orçamento foi \",IF(Q11=\"Sim\",\"COM\",\"SEM\"),\" Desoneração, e que esta é a alternativa mais adequada para a Administração Pública.\")","v":"Declaro para os devidos fins que o regime de Contribuição Previdenciária sobre a Receita Bruta adotado para elaboração do orçamento foi COM Desoneração, e que esta é a alternativa mais adequada para a Administração Pública."}]
["Fornecimento de Materiais e Equipamentos (aquisição indireta - em conjunto com licitação de obras)","AC","Fornecimento de Materiais e Equipamentos (aquisição indireta - em conjunto com licitação de obras)-AC",null,1.4999999999999999E-2,3.4500000000000003E-2,4.4900000000000002E-2]
[{"$f":"A38","v":"Fornecimento de Materiais e Equipamentos (aquisição indireta - em conjunto com licitação de obras)"},"SG","Fornecimento de Materiais e Equipamentos (aquisição indireta - em conjunto com licitação de obras)-SG",null,3.0000000000000001E-3,4.7999999999999996E-3,8.199999999999999E-3,null,"Observações:"]
[{"$f":"A39","v":"Fornecimento de Materiais e Equipamentos (aquisição indireta - em conjunto com licitação de obras)"},"R","Fornecimento de Materiais e Equipamentos (aquisição indireta - em conjunto com licitação de obras)-R",null,5.6000000000000008E-3,8.5000000000000006E-3,8.8999999999999999E-3]
[{"$f":"A40","v":"Fornecimento de Materiais e Equipamentos (aquisição indireta - em conjunto com licitação de obras)"},"DF","Fornecimento de Materiais e Equipamentos (aquisição indireta - em conjunto com licitação de obras)-DF",null,8.5000000000000006E-3,8.5000000000000006E-3,1.11E-2]
[{"$f":"A41","v":"Fornecimento de Materiais e Equipamentos (aquisição indireta - em conjunto com licitação de obras)"},"L","Fornecimento de Materiais e Equipamentos (aquisição indireta - em conjunto com licitação de obras)-L",null,3.5000000000000003E-2,5.1100000000000007E-2,6.2199999999999998E-2,null,{"$f":"PO!K156","v":"SÃO JOSÉ DO OURO / RS"},null,null,null,null,null,{"$f":"PO!K159","v":"2025-11-02"}]
[{"$f":"A42","v":"Fornecimento de Materiais e Equipamentos (aquisição indireta - em conjunto com licitação de obras)"},"BDI PAD","Fornecimento de Materiais e Equipamentos (aquisição indireta - em conjunto com licitação de obras)-BDI PAD",null,0.111,0.14019999999999999,0.16800000000000001,null,"Local",null,null,null,null,null,"Data"]
["Estudos e Projetos, Planos e Gerenciamento e outros correlatos","K1","Estudos e Projetos, Planos e Gerenciamento e outros correlatos-K1",null,"-","-","-"]
[{"$f":"A44","v":"Estudos e Projetos, Planos e Gerenciamento e outros correlatos"},"K2","Estudos e Projetos, Planos e Gerenciamento e outros correlatos-K2",null,"-",0.2,"-"]
[{"$f":"A45","v":"Estudos e Projetos, Planos e Gerenciamento e outros correlatos"},"","Estudos e Projetos, Planos e Gerenciamento e outros correlatos-",null,"-","-","-",null,"Responsável Técnico",null,null,null,null,null,"Responsável Tomador"]
[{"$f":"A46","v":"Estudos e Projetos, Planos e Gerenciamento e outros correlatos"},"","Estudos e Projetos, Planos e Gerenciamento e outros correlatos-",null,"-","-","-",null,"Nome:",{"$f":"DADOS!B54","v":"LEONARDO CONSORTE"},null,null,null,null,"Nome:","Antônio José Bianchin"]
[{"$f":"A47","v":"Estudos e Projetos, Planos e Gerenciamento e outros correlatos"},"K3","Estudos e Projetos, Planos e Gerenciamento e outros correlatos-K3",null,"-",0.12,"-",null,"Título:",{"$f":"DADOS!B55","v":"ENG. CIVIL"},null,null,null,null,"Cargo:","Prefeito Munipal"]
[{"$f":"A48","v":"Estudos e Projetos, Planos e Gerenciamento e outros correlatos"},"BDI PAD","Estudos e Projetos, Planos e Gerenciamento e outros correlatos-BDI PAD",null,"-","-","-",null,{"$f":"DADOS!A56","v":"CREA/CAU:"},{"$f":"DADOS!B56","v":"1331921"}]
[null,null,null,null,null,null,null,null,{"$f":"DADOS!A57","v":"ART/RRT:"},{"$f":"DADOS!B57","v":"13901876"}]
[]
["Construção e Reforma de Edifícios"]
["Construção de Praças Urbanas, Rodovias, Ferrovias e recapeamento e pavimentação de vias urbanas"]
["Construção de Redes de Abastecimento de Água, Coleta de Esgoto"]
["Construção e Manutenção de Estações e Redes de Distribuição de Energia Elétrica"]
["Obras Portuárias, Marítimas e Fluviais"]
["Fornecimento de Materiais e Equipamentos (aquisição indireta - em conjunto com licitação de obras)"]
["Fornecimento de Materiais e Equipamentos (aquisição direta)"]
["Estudos e Projetos, Planos e Gerenciamento e outros correlatos"]

{"sheet":"BDI (2)","index":2,"n_rows":59,"n_cols":23,"rows_kept":59,"cut":false,"hidden":false,"merged":[[7,8,7,17],[3,8,3,9],[3,10,3,17],[4,8,4,9],[4,10,4,17],[6,8,6,17],[9,8,9,15],[9,16,9,17],[10,8,10,15],[10,16,10,17],[12,8,12,15],[12,16,12,17],[13,8,13,15],[13,16,13,17],[15,8,16,11],[15,12,16,12],[15,13,16,13],[15,14,16,14],[15,15,16,15],[15,16,16,16],[15,17,16,17],[15,19,23,20],[17,8,17,11],[18,8,18,11],[19,8,19,11],[20,8,20,11],[21,8,21,11],[22,8,22,11],[23,8,23,11],[36,8,36,17],[24,8,24,11],[25,8,25,11],[26,8,26,11],[26,15,26,17],[28,9,28,17],[30,8,30,17],[31,11,32,11],[31,12,31,14],[31,15,32,15],[32,12,32,14],[34,8,34,17],[39,8,39,17],[41,8,41,11],[41,14,41,17],[42,8,42,11],[44,8,44,11],[44,14,44,17],[48,9,48,11],[49,9,49,11],[45,8,45,11],[45,14,45,17],[46,9,46,11],[46,15,46,17],[47,9,47,11],[47,15,47,17]]}
[null,null,null,null,"MIN","MED","MAX",null,null,null,null,null,null,{"$f":"\"Quadro de Composição do BDI \"&MID(CELL(\"nome.arquivo\",N1),5+FIND(\"BDI (\",CELL(\"nome.arquivo\",N1)),1)","v":"Quadro de Composição do BDI 2"}]
["Construção e Reforma de Edifícios","AC",{"$f":"CONCATENATE(A2,\"-\",B2)","v":"Construção e Reforma de Edifícios-AC"},null,0.03,0.04,5.5E-2]
[{"$f":"A2","v":"Construção e Reforma de Edifícios"},"SG","Construção e Reforma de Edifícios-SG",null,8.0000000000000002E-3,8.0000000000000002E-3,0.01]
[{"$f":"A3","v":"Construção e Reforma de Edifícios"},"R","Construção e Reforma de Edifícios-R",null,9.7000000000000003E-3,1.2699999999999999E-2,1.2699999999999999E-2,null,"Nº TC/CR",null,"PROPONENTE / TOMADOR"]
[{"$f":"A4","v":"Construção e Reforma de Edifícios"},"DF","Construção e Reforma de Edifícios-DF",null,5.8999999999999999E-3,1.23E-2,1.3899999999999999E-2,null,{"$f":"DADOS!A29","v":"-"},null,{"$f":"DADOS!A32","v":"CÂMARA DE VEREADORES DE SÃO JOSÉ DO OURO"}]
[{"$f":"A5","v":"Construção e Reforma de Edifícios"},"L","Construção e Reforma de Edifícios-L",null,6.1600000000000002E-2,7.400000000000001E-2,8.9600000000000013E-2]
[{"$f":"A6","v":"Construção e Reforma de Edifícios"},"BDI PAD","Construção e Reforma de Edifícios-BDI PAD",null,0.2034,0.22120000000000001,0.25,null,"OBJETO"]
["Construção de Praças Urbanas, Rodovias, Ferrovias e recapeamento e pavimentação de vias urbanas","AC","Construção de Praças Urbanas, Rodovias, Ferrovias e recapeamento e pavimentação de vias urbanas-AC",null,3.7999999999999999E-2,4.0099999999999997E-2,4.6699999999999998E-2,null,{"$f":"DADOS!P29","v":"REFORMA DA CÂMARA DE VEREADORES DE SÃO JOSÉ DO OURO"}]
["Construção de Praças Urbanas, Rodovias, Ferrovias e recapeamento e pavimentação de vias urbanas","SG","Construção de Praças Urbanas, Rodovias, Ferrovias e recapeamento e pavimentação de vias urbanas-SG",null,3.2000000000000002E-3,4.0000000000000001E-3,7.4000000000000003E-3]
["Construção de Praças Urbanas, Rodovias, Ferrovias e recapeamento e pavimentação de vias urbanas","R","Construção de Praças Urbanas, Rodovias, Ferrovias e recapeamento e pavimentação de vias urbanas-R",null,5.0000000000000001E-3,5.6000000000000008E-3,9.7000000000000003E-3,null,"TIPO DE OBRA DO EMPREENDIMENTO",null,null,null,null,null,null,null,"DESONERAÇÃO"]
["Construção de Praças Urbanas, Rodovias, Ferrovias e recapeamento e pavimentação de vias urbanas","DF","Construção de Praças Urbanas, Rodovias, Ferrovias e recapeamento e pavimentação de vias urbanas-DF",null,1.0200000000000001E-2,1.11E-2,1.21E-2,null,"Fornecimento de Materiais e Equipamentos (aquisição direta)",null,null,null,null,null,null,null,{"$f":"DADOS!$C$38","v":"Sim"}]
["Construção de Praças Urbanas, Rodovias, Ferrovias e recapeamento e pavimentação de vias urbanas","L","Construção de Praças Urbanas, Rodovias, Ferrovias e recapeamento e pavimentação de vias urbanas-L",null,6.6400000000000001E-2,7.2999999999999995E-2,8.6899999999999991E-2]
["Construção de Praças Urbanas, Rodovias, Ferrovias e recapeamento e pavimentação de vias urbanas","BDI PAD","Construção de Praças Urbanas, Rodovias, Ferrovias e recapeamento e pavimentação de vias urbanas-BDI PAD",null,0.19600000000000001,0.2097,0.24230000000000002,null,"Conforme legislação tributária municipal, definir estimativa de percentual da base de cálculo para o ISS:",null,null,null,null,null,null,null,1]
["Construção de Redes de Abastecimento de Água, Coleta de Esgoto","AC","Construção de Redes de Abastecimento de Água, Coleta de Esgoto-AC",null,3.4300000000000004E-2,4.9299999999999997E-2,6.7099999999999993E-2,null,"Sobre a base de cálculo, definir a respectiva alíquota do ISS (entre 2% e 5%):",null,null,null,null,null,null,null,0.02]
[{"$f":"A14","v":"Construção de Redes de Abastecimento de Água, Coleta de Esgoto"},"SG","Construção de Redes de Abastecimento de Água, Coleta de Esgoto-SG",null,2.8000000000000004E-3,4.8999999999999998E-3,7.4999999999999997E-3]
[null,null,null,null,null,null,null,null,"Itens",null,null,null,"Siglas","% Adotado","Situação","1º Quartil","Médio","3º Quartil",null,{"$f":"IF(V27,\"Para BDI fora do intervalo estatístico, deve ser apresentado Relatório Técnico Circunstanciado justificando a adoção do percentual de cada parcela do BDI.\",\"\")","v":""}]
[{"$f":"A15","v":"Construção de Redes de Abastecimento de Água, Coleta de Esgoto"},"R","Construção de Redes de Abastecimento de Água, Coleta de Esgoto-R",null,0.01,1.3899999999999999E-2,1.7399999999999999E-2]
[{"$f":"A17","v":"Construção de Redes de Abastecimento de Água, Coleta de Esgoto"},"DF","Construção de Redes de Abastecimento de Água, Coleta de Esgoto-DF",null,9.3999999999999986E-3,9.8999999999999991E-3,1.1699999999999999E-2,null,{"$f":"IF($I$11=$A$59,\"Encargos Sociais incidentes sobre a mão de obra\",\"Administração Central\")","v":"Administração Central"},null,null,null,{"$f":"IF($I$11=$A$59,\"K1\",\"AC\")","v":"AC"},null,"-",{"$f":"VLOOKUP(CONCATENATE(I$11,\"-\",M18),$C$2:$G$49,3,FALSE)","v":{"$error":"#N/A"}},{"$f":"VLOOKUP(CONCATENATE(I$11,\"-\",M18),$C$2:$G$49,4,FALSE)","v":{"$error":"#N/A"}},{"$f":"VLOOKUP(CONCATENATE(I$11,\"-\",M18),$C$2:$G$49,5,FALSE)","v":{"$error":"#N/A"}}]
[{"$f":"A18","v":"Construção de Redes de Abastecimento de Água, Coleta de Esgoto"},"L","Construção de Redes de Abastecimento de Água, Coleta de Esgoto-L",null,6.7400000000000002E-2,8.0399999999999985E-2,9.4E-2,null,{"$f":"IF($I$11=$A$59,\"Administração Central da empresa ou consultoria - overhead\",\"Seguro e Garantia\")","v":"Seguro e Garantia"},null,null,null,{"$f":"IF($I$11=$A$59,\"K2\",\"SG\")","v":"SG"},null,"-",{"$f":"VLOOKUP(CONCATENATE(I$11,\"-\",M19),$C$2:$G$49,3,FALSE)","v":{"$error":"#N/A"}},{"$f":"VLOOKUP(CONCATENATE(I$11,\"-\",M19),$C$2:$G$49,4,FALSE)","v":{"$error":"#N/A"}},{"$f":"VLOOKUP(CONCATENATE(I$11,\"-\",M19),$C$2:$G$49,5,FALSE)","v":{"$error":"#N/A"}}]
[{"$f":"A19","v":"Construção de Redes de Abastecimento de Água, Coleta de Esgoto"},"BDI PAD","Construção de Redes de Abastecimento de Água, Coleta de Esgoto-BDI PAD",null,0.20760000000000001,0.24179999999999999,0.26440000000000002,null,{"$f":"IF($I$11=$A$59,\"\",\"Risco\")","v":"Risco"},null,null,null,{"$f":"IF($I$11=$A$59,\"\",\"R\")","v":"R"},null,"-",{"$f":"VLOOKUP(CONCATENATE(I$11,\"-\",M20),$C$2:$G$49,3,FALSE)","v":{"$error":"#N/A"}},{"$f":"VLOOKUP(CONCATENATE(I$11,\"-\",M20),$C$2:$G$49,4,FALSE)","v":{"$error":"#N/A"}},{"$f":"VLOOKUP(CONCATENATE(I$11,\"-\",M20),$C$2:$G$49,5,FALSE)","v":{"$error":"#N/A"}}]
["Construção e Manutenção de Estações e Redes de Distribuição de Energia Elétrica","AC","Construção e Manutenção de Estações e Redes de Distribuição de Energia Elétrica-AC",null,5.2900000000000003E-2,5.9200000000000003E-2,7.9299999999999995E-2,null,{"$f":"IF($I$11=$A$59,\"\",\"Despesas Financeiras\")","v":"Despesas Financeiras"},null,null,null,{"$f":"IF($I$11=$A$59,\"\",\"DF\")","v":"DF"},null,"-",{"$f":"VLOOKUP(CONCATENATE(I$11,\"-\",M21),$C$2:$G$49,3,FALSE)","v":{"$error":"#N/A"}},{"$f":"VLOOKUP(CONCATENATE(I$11,\"-\",M21),$C$2:$G$49,4,FALSE)","v":{"$error":"#N/A"}},{"$f":"VLOOKUP(CONCATENATE(I$11,\"-\",M21),$C$2:$G$49,5,FALSE)","v":{"$error":"#N/A"}}]
[{"$f":"A21","v":"Construção e Manutenção de Estações e Redes de Distribuição de Energia Elétrica"},"SG","Construção e Manutenção de Estações e Redes de Distribuição de Energia Elétrica-SG",null,2.5000000000000001E-3,5.1000000000000004E-3,5.6000000000000008E-3,null,{"$f":"IF($I$11=$A$59,\"Margem bruta da empresa de consultoria\",\"Lucro\")","v":"Lucro"},null,null,null,{"$f":"IF($I$11=$A$59,\"K3\",\"L\")","v":"L"},null,"-",{"$f":"VLOOKUP(CONCATENATE(I$11,\"-\",M22),$C$2:$G$49,3,FALSE)","v":{"$error":"#N/A"}},{"$f":"VLOOKUP(CONCATENATE(I$11,\"-\",M22),$C$2:$G$49,4,FALSE)","v":{"$error":"#N/A"}},{"$f":"VLOOKUP(CONCATENATE(I$11,\"-\",M22),$C$2:$G$49,5,FALSE)","v":{"$error":"#N/A"}}]
[{"$f":"A22","v":"Construção e Manutenção de Estações e Redes de Distribuição de Energia Elétrica"},"R","Construção e Manutenção de Estações e Redes de Distribuição de Energia Elétrica-R",null,0.01,1.4800000000000001E-2,1.9699999999999999E-2,null,"Tributos (impostos COFINS 3%, e  PIS 0,65%)",null,null,null,"CP",null,"-",3.6499999999999998E-2,3.6499999999999998E-2,3.6499999999999998E-2]
[{"$f":"A23","v":"Construção e Manutenção de Estações e Redes de Distribuição de Energia Elétrica"},"DF","Construção e Manutenção de Estações e Redes de Distribuição de Energia Elétrica-DF",null,1.01E-2,1.0700000000000001E-2,1.11E-2,null,"Tributos (ISS, variável de acordo com o município)",null,null,null,"ISS",{"$f":"IF($I$11<>$A$58,Q14*Q13,0)","v":0},"-",0,2.5000000000000001E-2,0.05]
[{"$f":"A24","v":"Construção e Manutenção de Estações e Redes de Distribuição de Energia Elétrica"},"L","Construção e Manutenção de Estações e Redes de Distribuição de Energia Elétrica-L",null,0.08,8.3100000000000007E-2,9.5100000000000004E-2,null,"Tributos (Contribuição Previdenciária sobre a Receita Bruta - 0% ou 4,5% - Desoneração)",null,null,null,"CPRB",{"$f":"IF(AND($I$11<>$A$58,Q11=\"Sim\"),4.5%,0%)","v":0},{"$f":"IF(AND(N25>=P25, N25<=R25), \"OK\", \"Não OK\")","v":"OK"},0,4.4999999999999998E-2,4.4999999999999998E-2]
[{"$f":"A25","v":"Construção e Manutenção de Estações e Redes de Distribuição de Energia Elétrica"},"BDI PAD","Construção e Manutenção de Estações e Redes de Distribuição de Energia Elétrica-BDI PAD",null,0.24,0.25840000000000002,0.27860000000000001,null,"BDI SEM desoneração\n(Fórmula Acórdão TCU)",null,null,null,"BDI PAD",{"$f":"IF($I$11=$A$58,0,ROUND((((1+N18+N19+N20)*(1+N21)*(1+N22)/(1-(N23+N24)))-1),4))","v":0},{"$f":"IF(OR($I$11=$A$59,$I$11=$A$58,AND(N26>=P26, N26<=R26)), \"OK\", \"FORA DO INTERVALO\")","v":"OK"},{"$f":"IF($I$11=$A$58,0,VLOOKUP(CONCATENATE($I$11,\"-\",$M26),$C$2:$G$49,3,FALSE))","v":0},{"$f":"IF($I$11=$A$58,0,VLOOKUP(CONCATENATE($I$11,\"-\",$M26),$C$2:$G$49,4,FALSE))","v":0},{"$f":"IF($I$11=$A$58,0,VLOOKUP(CONCATENATE($I$11,\"-\",$M26),$C$2:$G$49,5,FALSE))","v":0}]
["Obras Portuárias, Marítimas e Fluviais","AC","Obras Portuárias, Marítimas e Fluviais-AC",null,0.04,5.5199999999999999E-2,7.85E-2,null,"BDI COM desoneração",null,null,null,"BDI DES",{"$f":"IF($I$11=$A$58,0,ROUND((((1+N18+N19+N20)*(1+N21)*(1+N22)/(1-(N23+N24+N25)))-1),4))","v":0},{"$f":"IF(Q11<>\"Sim\",\"\",O26)","v":"OK"},null,null,null,null,null,null,{"$f":"AND(COUNTA(N18:N23)=6,O26<>\"ok\",NOT(V29))","v":false},"pedir anexo"]
[{"$f":"A27","v":"Obras Portuárias, Marítimas e Fluviais"},"SG","Obras Portuárias, Marítimas e Fluviais-SG",null,8.1000000000000013E-3,1.2199999999999999E-2,1.9900000000000001E-2]
[{"$f":"A28","v":"Obras Portuárias, Marítimas e Fluviais"},"R","Obras Portuárias, Marítimas e Fluviais-R",null,1.46E-2,2.3199999999999998E-2,3.1600000000000003E-2,null,{"$f":"IF(V29,\"X\",\"\")","v":""},"Anexo: Relatório Técnico Circunstanciado justificando a adoção do percentual de cada parcela do BDI.",null,null,null,null,null,null,null,null,null,null,null,false,"anexo apresentado"]
[]
[null,null,null,null,null,null,null,null,"Os valores de BDI foram calculados com o emprego da fórmula:"]
[{"$f":"A29","v":"Obras Portuárias, Marítimas e Fluviais"},"DF","Obras Portuárias, Marítimas e Fluviais-DF",null,9.3999999999999986E-3,1.0200000000000001E-2,1.3300000000000001E-2,null,null,null,null,{"$f":"IF(Q11=\"Sim\",\"BDI.DES =\",\"BDI.PAD =\")","v":"BDI.DES ="},{"$f":"IF($I$11=$A$59,\"(1+K1+K2)*(1+K3)\",\"(1+AC + S + R + G)*(1 + DF)*(1+L)\")","v":"(1+AC + S + R + G)*(1 + DF)*(1+L)"},null,null," - 1"]
[{"$f":"A32","v":"Obras Portuárias, Marítimas e Fluviais"},"L","Obras Portuárias, Marítimas e Fluviais-L",null,7.1399999999999991E-2,8.4000000000000005E-2,0.1043,null,null,null,null,null,{"$f":"IF(Q11=\"Sim\",\"(1-CP-ISS-CRPB)\",\"(1-CP-ISS)\")","v":"(1-CP-ISS-CRPB)"}]
[{"$f":"A33","v":"Obras Portuárias, Marítimas e Fluviais"},"BDI PAD","Obras Portuárias, Marítimas e Fluviais-BDI PAD",null,0.22800000000000001,0.27479999999999999,0.3095]
[null,null,null,null,null,null,null,null,{"$f":"CONCATENATE(\"Declaro para os devidos fins que, conforme legislação tributária municipal, a base de cálculo para \",I11,\", é de \",Q13*100,\"%, com a respectiva alíquota de \",Q14*100,\"%.\")","v":"Declaro para os devidos fins que, conforme legislação tributária municipal, a base de cálculo para Fornecimento de Materiais e Equipamentos (aquisição direta), é de 100%, com a respectiva alíquota de 2%."}]
[]
[null,null,null,null,null,null,null,null,{"$f":"CONCATENATE(\"Declaro para os devidos fins que o regime de Contribuição Previdenciária sobre a Receita Bruta adotado para elaboração do orçamento foi \",IF(Q11=\"Sim\",\"COM\",\"SEM\"),\" Desoneração, e que esta é a alternativa mais adequada para a Administração Pública.\")","v":"Declaro para os devidos fins que o regime de Contribuição Previdenciária sobre a Receita Bruta adotado para elaboração do orçamento foi COM Desoneração, e que esta é a alternativa mais adequada para a Administração Pública."}]
["Fornecimento de Materiais e Equipamentos (aquisição indireta - em conjunto com licitação de obras)","AC","Fornecimento de Materiais e Equipamentos (aquisição indireta - em conjunto com licitação de obras)-AC",null,1.4999999999999999E-2,3.4500000000000003E-2,4.4900000000000002E-2]
[{"$f":"A38","v":"Fornecimento de Materiais e Equipamentos (aquisição indireta - em conjunto com licitação de obras)"},"SG","Fornecimento de Materiais e Equipamentos (aquisição indireta - em conjunto com licitação de obras)-SG",null,3.0000000000000001E-3,4.7999999999999996E-3,8.199999999999999E-3,null,"Observações:"]
[{"$f":"A39","v":"Fornecimento de Materiais e Equipamentos (aquisição indireta - em conjunto com licitação de obras)"},"R","Fornecimento de Materiais e Equipamentos (aquisição indireta - em conjunto com licitação de obras)-R",null,5.6000000000000008E-3,8.5000000000000006E-3,8.8999999999999999E-3]
[{"$f":"A40","v":"Fornecimento de Materiais e Equipamentos (aquisição indireta - em conjunto com licitação de obras)"},"DF","Fornecimento de Materiais e Equipamentos (aquisição indireta - em conjunto com licitação de obras)-DF",null,8.5000000000000006E-3,8.5000000000000006E-3,1.11E-2]
[{"$f":"A41","v":"Fornecimento de Materiais e Equipamentos (aquisição indireta - em conjunto com licitação de obras)"},"L","Fornecimento de Materiais e Equipamentos (aquisição indireta - em conjunto com licitação de obras)-L",null,3.5000000000000003E-2,5.1100000000000007E-2,6.2199999999999998E-2,null,{"$f":"PO!K156","v":"SÃO JOSÉ DO OURO / RS"},null,null,null,null,null,{"$f":"PO!K159","v":"2025-11-02"}]
[{"$f":"A42","v":"Fornecimento de Materiais e Equipamentos (aquisição indireta - em conjunto com licitação de obras)"},"BDI PAD","Fornecimento de Materiais e Equipamentos (aquisição indireta - em conjunto com licitação de obras)-BDI PAD",null,0.111,0.14019999999999999,0.16800000000000001,null,"Local",null,null,null,null,null,"Data"]
["Estudos e Projetos, Planos e Gerenciamento e outros correlatos","K1","Estudos e Projetos, Planos e Gerenciamento e outros correlatos-K1",null,"-","-","-"]
[{"$f":"A44","v":"Estudos e Projetos, Planos e Gerenciamento e outros correlatos"},"K2","Estudos e Projetos, Planos e Gerenciamento e outros correlatos-K2",null,"-",0.2,"-"]
[{"$f":"A45","v":"Estudos e Projetos, Planos e Gerenciamento e outros correlatos"},"","Estudos e Projetos, Planos e Gerenciamento e outros correlatos-",null,"-","-","-",null,"Responsável Técnico",null,null,null,null,null,"Responsável Tomador"]
[{"$f":"A46","v":"Estudos e Projetos, Planos e Gerenciamento e outros correlatos"},"","Estudos e Projetos, Planos e Gerenciamento e outros correlatos-",null,"-","-","-",null,"Nome:",{"$f":"DADOS!B54","v":"LEONARDO CONSORTE"},null,null,null,null,"Nome:","Antônio José Bianchin"]
[{"$f":"A47","v":"Estudos e Projetos, Planos e Gerenciamento e outros correlatos"},"K3","Estudos e Projetos, Planos e Gerenciamento e outros correlatos-K3",null,"-",0.12,"-",null,"Título:",{"$f":"DADOS!B55","v":"ENG. CIVIL"},null,null,null,null,"Cargo:","Prefeito Munipal"]
[{"$f":"A48","v":"Estudos e Projetos, Planos e Gerenciamento e outros correlatos"},"BDI PAD","Estudos e Projetos, Planos e Gerenciamento e outros correlatos-BDI PAD",null,"-","-","-",null,{"$f":"DADOS!A56","v":"CREA/CAU:"},{"$f":"DADOS!B56","v":"1331921"}]
[null,null,null,null,null,null,null,null,{"$f":"DADOS!A57","v":"ART/RRT:"},{"$f":"DADOS!B57","v":"13901876"}]
[]
["Construção e Reforma de Edifícios"]
["Construção de Praças Urbanas, Rodovias, Ferrovias e recapeamento e pavimentação de vias urbanas"]
["Construção de Redes de Abastecimento de Água, Coleta de Esgoto"]
["Construção e Manutenção de Estações e Redes de Distribuição de Energia Elétrica"]
["Obras Portuárias, Marítimas e Fluviais"]
["Fornecimento de Materiais e Equipamentos (aquisição indireta - em conjunto com licitação de obras)"]
["Fornecimento de Materiais e Equipamentos (aquisição direta)"]
["Estudos e Projetos, Planos e Gerenciamento e outros correlatos"]

{"sheet":"BDI (3)","index":3,"n_rows":59,"n_cols":23,"rows_kept":59,"cut":false,"hidden":false,"merged":[[48,9,48,11],[49,9,49,11],[45,8,45,11],[45,14,45,17],[46,9,46,11],[46,15,46,17],[47,9,47,11],[47,15,47,17],[39,8,39,17],[41,8,41,11],[41,14,41,17],[42,8,42,11],[44,8,44,11],[44,14,44,17],[36,8,36,17],[24,8,24,11],[25,8,25,11],[26,8,26,11],[26,15,26,17],[28,9,28,17],[30,8,30,17],[31,11,32,11],[31,12,31,14],[31,15,32,15],[32,12,32,14],[34,8,34,17],[15,19,23,20],[17,8,17,11],[18,8,18,11],[19,8,19,11],[20,8,20,11],[21,8,21,11],[22,8,22,11],[23,8,23,11],[13,8,13,15],[13,16,13,17],[15,8,16,11],[15,12,16,12],[15,13,16,13],[15,14,16,14],[15,15,16,15],[15,16,16,16],[15,17,16,17],[9,8,9,15],[9,16,9,17],[10,8,10,15],[10,16,10,17],[12,8,12,15],[12,16,12,17],[7,8,7,17],[3,8,3,9],[3,10,3,17],[4,8,4,9],[4,10,4,17],[6,8,6,17]]}
[null,null,null,null,"MIN","MED","MAX",null,null,null,null,null,null,{"$f":"\"Quadro de Composição do BDI \"&MID(CELL(\"nome.arquivo\",N1),5+FIND(\"BDI (\",CELL(\"nome.arquivo\",N1)),1)","v":"Quadro de Composição do BDI 3"}]
["Construção e Reforma de Edifícios","AC",{"$f":"CONCATENATE(A2,\"-\",B2)","v":"Construção e Reforma de Edifícios-AC"},null,0.03,0.04,5.5E-2]
[{"$f":"A2","v":"Construção e Reforma de Edifícios"},"SG","Construção e Reforma de Edifícios-SG",null,8.0000000000000002E-3,8.0000000000000002E-3,0.01]
[{"$f":"A3","v":"Construção e Reforma de Edifícios"},"R","Construção e Reforma de Edifícios-R",null,9.7000000000000003E-3,1.2699999999999999E-2,1.2699999999999999E-2,null,"Nº TC/CR",null,"PROPONENTE / TOMADOR"]
[{"$f":"A4","v":"Construção e Reforma de Edifícios"},"DF","Construção e Reforma de Edifícios-DF",null,5.8999999999999999E-3,1.23E-2,1.3899999999999999E-2,null,{"$f":"DADOS!A29","v":"-"},null,{"$f":"DADOS!A32","v":"CÂMARA DE VEREADORES DE SÃO JOSÉ DO OURO"}]
[{"$f":"A5","v":"Construção e Reforma de Edifícios"},"L","Construção e Reforma de Edifícios-L",null,6.1600000000000002E-2,7.400000000000001E-2,8.9600000000000013E-2]
[{"$f":"A6","v":"Construção e Reforma de Edifícios"},"BDI PAD","Construção e Reforma de Edifícios-BDI PAD",null,0.2034,0.22120000000000001,0.25,null,"OBJETO"]
["Construção de Praças Urbanas, Rodovias, Ferrovias e recapeamento e pavimentação de vias urbanas","AC","Construção de Praças Urbanas, Rodovias, Ferrovias e recapeamento e pavimentação de vias urbanas-AC",null,3.7999999999999999E-2,4.0099999999999997E-2,4.6699999999999998E-2,null,{"$f":"DADOS!P29","v":"REFORMA DA CÂMARA DE VEREADORES DE SÃO JOSÉ DO OURO"}]
["Construção de Praças Urbanas, Rodovias, Ferrovias e recapeamento e pavimentação de vias urbanas","SG","Construção de Praças Urbanas, Rodovias, Ferrovias e recapeamento e pavimentação de vias urbanas-SG",null,3.2000000000000002E-3,4.0000000000000001E-3,7.4000000000000003E-3]
["Construção de Praças Urbanas, Rodovias, Ferrovias e recapeamento e pavimentação de vias urbanas","R","Construção de Praças Urbanas, Rodovias, Ferrovias e recapeamento e pavimentação de vias urbanas-R",null,5.0000000000000001E-3,5.6000000000000008E-3,9.7000000000000003E-3,null,"TIPO DE OBRA DO EMPREENDIMENTO",null,null,null,null,null,null,null,"DESONERAÇÃO"]
["Construção de Praças Urbanas, Rodovias, Ferrovias e recapeamento e pavimentação de vias urbanas","DF","Construção de Praças Urbanas, Rodovias, Ferrovias e recapeamento e pavimentação de vias urbanas-DF",null,1.0200000000000001E-2,1.11E-2,1.21E-2,null,"Fornecimento de Materiais e Equipamentos (aquisição direta)",null,null,null,null,null,null,null,{"$f":"DADOS!$C$38","v":"Sim"}]
["Construção de Praças Urbanas, Rodovias, Ferrovias e recapeamento e pavimentação de vias urbanas","L","Construção de Praças Urbanas, Rodovias, Ferrovias e recapeamento e pavimentação de vias urbanas-L",null,6.6400000000000001E-2,7.2999999999999995E-2,8.6899999999999991E-2]
["Construção de Praças Urbanas, Rodovias, Ferrovias e recapeamento e pavimentação de vias urbanas","BDI PAD","Construção de Praças Urbanas, Rodovias, Ferrovias e recapeamento e pavimentação de vias urbanas-BDI PAD",null,0.19600000000000001,0.2097,0.24230000000000002,null,"Conforme legislação tributária municipal, definir estimativa de percentual da base de cálculo para o ISS:",null,null,null,null,null,null,null,1]
["Construção de Redes de Abastecimento de Água, Coleta de Esgoto","AC","Construção de Redes de Abastecimento de Água, Coleta de Esgoto-AC",null,3.4300000000000004E-2,4.9299999999999997E-2,6.7099999999999993E-2,null,"Sobre a base de cálculo, definir a respectiva alíquota do ISS (entre 2% e 5%):",null,null,null,null,null,null,null,0.02]
[{"$f":"A14","v":"Construção de Redes de Abastecimento de Água, Coleta de Esgoto"},"SG","Construção de Redes de Abastecimento de Água, Coleta de Esgoto-SG",null,2.8000000000000004E-3,4.8999999999999998E-3,7.4999999999999997E-3]
[null,null,null,null,null,null,null,null,"Itens",null,null,null,"Siglas","% Adotado","Situação","1º Quartil","Médio","3º Quartil",null,{"$f":"IF(V27,\"Para BDI fora do intervalo estatístico, deve ser apresentado Relatório Técnico Circunstanciado justificando a adoção do percentual de cada parcela do BDI.\",\"\")","v":""}]
[{"$f":"A15","v":"Construção de Redes de Abastecimento de Água, Coleta de Esgoto"},"R","Construção de Redes de Abastecimento de Água, Coleta de Esgoto-R",null,0.01,1.3899999999999999E-2,1.7399999999999999E-2]
[{"$f":"A17","v":"Construção de Redes de Abastecimento de Água, Coleta de Esgoto"},"DF","Construção de Redes de Abastecimento de Água, Coleta de Esgoto-DF",null,9.3999999999999986E-3,9.8999999999999991E-3,1.1699999999999999E-2,null,{"$f":"IF($I$11=$A$59,\"Encargos Sociais incidentes sobre a mão de obra\",\"Administração Central\")","v":"Administração Central"},null,null,null,{"$f":"IF($I$11=$A$59,\"K1\",\"AC\")","v":"AC"},0,"-",{"$f":"VLOOKUP(CONCATENATE(I$11,\"-\",M18),$C$2:$G$49,3,FALSE)","v":{"$error":"#N/A"}},{"$f":"VLOOKUP(CONCATENATE(I$11,\"-\",M18),$C$2:$G$49,4,FALSE)","v":{"$error":"#N/A"}},{"$f":"VLOOKUP(CONCATENATE(I$11,\"-\",M18),$C$2:$G$49,5,FALSE)","v":{"$error":"#N/A"}}]
[{"$f":"A18","v":"Construção de Redes de Abastecimento de Água, Coleta de Esgoto"},"L","Construção de Redes de Abastecimento de Água, Coleta de Esgoto-L",null,6.7400000000000002E-2,8.0399999999999985E-2,9.4E-2,null,{"$f":"IF($I$11=$A$59,\"Administração Central da empresa ou consultoria - overhead\",\"Seguro e Garantia\")","v":"Seguro e Garantia"},null,null,null,{"$f":"IF($I$11=$A$59,\"K2\",\"SG\")","v":"SG"},0,"-",{"$f":"VLOOKUP(CONCATENATE(I$11,\"-\",M19),$C$2:$G$49,3,FALSE)","v":{"$error":"#N/A"}},{"$f":"VLOOKUP(CONCATENATE(I$11,\"-\",M19),$C$2:$G$49,4,FALSE)","v":{"$error":"#N/A"}},{"$f":"VLOOKUP(CONCATENATE(I$11,\"-\",M19),$C$2:$G$49,5,FALSE)","v":{"$error":"#N/A"}}]
[{"$f":"A19","v":"Construção de Redes de Abastecimento de Água, Coleta de Esgoto"},"BDI PAD","Construção de Redes de Abastecimento de Água, Coleta de Esgoto-BDI PAD",null,0.20760000000000001,0.24179999999999999,0.26440000000000002,null,{"$f":"IF($I$11=$A$59,\"\",\"Risco\")","v":"Risco"},null,null,null,{"$f":"IF($I$11=$A$59,\"\",\"R\")","v":"R"},0,"-",{"$f":"VLOOKUP(CONCATENATE(I$11,\"-\",M20),$C$2:$G$49,3,FALSE)","v":{"$error":"#N/A"}},{"$f":"VLOOKUP(CONCATENATE(I$11,\"-\",M20),$C$2:$G$49,4,FALSE)","v":{"$error":"#N/A"}},{"$f":"VLOOKUP(CONCATENATE(I$11,\"-\",M20),$C$2:$G$49,5,FALSE)","v":{"$error":"#N/A"}}]
["Construção e Manutenção de Estações e Redes de Distribuição de Energia Elétrica","AC","Construção e Manutenção de Estações e Redes de Distribuição de Energia Elétrica-AC",null,5.2900000000000003E-2,5.9200000000000003E-2,7.9299999999999995E-2,null,{"$f":"IF($I$11=$A$59,\"\",\"Despesas Financeiras\")","v":"Despesas Financeiras"},null,null,null,{"$f":"IF($I$11=$A$59,\"\",\"DF\")","v":"DF"},0,"-",{"$f":"VLOOKUP(CONCATENATE(I$11,\"-\",M21),$C$2:$G$49,3,FALSE)","v":{"$error":"#N/A"}},{"$f":"VLOOKUP(CONCATENATE(I$11,\"-\",M21),$C$2:$G$49,4,FALSE)","v":{"$error":"#N/A"}},{"$f":"VLOOKUP(CONCATENATE(I$11,\"-\",M21),$C$2:$G$49,5,FALSE)","v":{"$error":"#N/A"}}]
[{"$f":"A21","v":"Construção e Manutenção de Estações e Redes de Distribuição de Energia Elétrica"},"SG","Construção e Manutenção de Estações e Redes de Distribuição de Energia Elétrica-SG",null,2.5000000000000001E-3,5.1000000000000004E-3,5.6000000000000008E-3,null,{"$f":"IF($I$11=$A$59,\"Margem bruta da empresa de consultoria\",\"Lucro\")","v":"Lucro"},null,null,null,{"$f":"IF($I$11=$A$59,\"K3\",\"L\")","v":"L"},0,"-",{"$f":"VLOOKUP(CONCATENATE(I$11,\"-\",M22),$C$2:$G$49,3,FALSE)","v":{"$error":"#N/A"}},{"$f":"VLOOKUP(CONCATENATE(I$11,\"-\",M22),$C$2:$G$49,4,FALSE)","v":{"$error":"#N/A"}},{"$f":"VLOOKUP(CONCATENATE(I$11,\"-\",M22),$C$2:$G$49,5,FALSE)","v":{"$error":"#N/A"}}]
[{"$f":"A22","v":"Construção e Manutenção de Estações e Redes de Distribuição de Energia Elétrica"},"R","Construção e Manutenção de Estações e Redes de Distribuição de Energia Elétrica-R",null,0.01,1.4800000000000001E-2,1.9699999999999999E-2,null,"Tributos (impostos COFINS 3%, e  PIS 0,65%)",null,null,null,"CP",0,"-",3.6499999999999998E-2,3.6499999999999998E-2,3.6499999999999998E-2]
[{"$f":"A23","v":"Construção e Manutenção de Estações e Redes de Distribuição de Energia Elétrica"},"DF","Construção e Manutenção de Estações e Redes de Distribuição de Energia Elétrica-DF",null,1.01E-2,1.0700000000000001E-2,1.11E-2,null,"Tributos (ISS, variável de acordo com o município)",null,null,null,"ISS",{"$f":"IF($I$11<>$A$58,Q14*Q13,0)","v":0},"-",0,2.5000000000000001E-2,0.05]
[{"$f":"A24","v":"Construção e Manutenção de Estações e Redes de Distribuição de Energia Elétrica"},"L","Construção e Manutenção de Estações e Redes de Distribuição de Energia Elétrica-L",null,0.08,8.3100000000000007E-2,9.5100000000000004E-2,null,"Tributos (Contribuição Previdenciária sobre a Receita Bruta - 0% ou 4,5% - Desoneração)",null,null,null,"CPRB",{"$f":"IF(AND($I$11<>$A$58,Q11=\"Sim\"),4.5%,0%)","v":0},{"$f":"IF(AND(N25>=P25, N25<=R25), \"OK\", \"Não OK\")","v":"OK"},0,4.4999999999999998E-2,4.4999999999999998E-2]
[{"$f":"A25","v":"Construção e Manutenção de Estações e Redes de Distribuição de Energia Elétrica"},"BDI PAD","Construção e Manutenção de Estações e Redes de Distribuição de Energia Elétrica-BDI PAD",null,0.24,0.25840000000000002,0.27860000000000001,null,"BDI SEM desoneração\n(Fórmula Acórdão TCU)",null,null,null,"BDI PAD",{"$f":"IF($I$11=$A$58,0,ROUND((((1+N18+N19+N20)*(1+N21)*(1+N22)/(1-(N23+N24)))-1),4))","v":0},{"$f":"IF(OR($I$11=$A$59,$I$11=$A$58,AND(N26>=P26, N26<=R26)), \"OK\", \"FORA DO INTERVALO\")","v":"OK"},{"$f":"IF($I$11=$A$58,0,VLOOKUP(CONCATENATE($I$11,\"-\",$M26),$C$2:$G$49,3,FALSE))","v":0},{"$f":"IF($I$11=$A$58,0,VLOOKUP(CONCATENATE($I$11,\"-\",$M26),$C$2:$G$49,4,FALSE))","v":0},{"$f":"IF($I$11=$A$58,0,VLOOKUP(CONCATENATE($I$11,\"-\",$M26),$C$2:$G$49,5,FALSE))","v":0}]
["Obras Portuárias, Marítimas e Fluviais","AC","Obras Portuárias, Marítimas e Fluviais-AC",null,0.04,5.5199999999999999E-2,7.85E-2,null,"BDI COM desoneração",null,null,null,"BDI DES",{"$f":"IF($I$11=$A$58,0,ROUND((((1+N18+N19+N20)*(1+N21)*(1+N22)/(1-(N23+N24+N25)))-1),4))","v":0},{"$f":"IF(Q11<>\"Sim\",\"\",O26)","v":"OK"},null,null,null,null,null,null,{"$f":"AND(COUNTA(N18:N23)=6,O26<>\"ok\",NOT(V29))","v":false},"pedir anexo"]
[{"$f":"A27","v":"Obras Portuárias, Marítimas e Fluviais"},"SG","Obras Portuárias, Marítimas e Fluviais-SG",null,8.1000000000000013E-3,1.2199999999999999E-2,1.9900000000000001E-2]
[{"$f":"A28","v":"Obras Portuárias, Marítimas e Fluviais"},"R","Obras Portuárias, Marítimas e Fluviais-R",null,1.46E-2,2.3199999999999998E-2,3.1600000000000003E-2,null,{"$f":"IF(V29,\"X\",\"\")","v":""},"Anexo: Relatório Técnico Circunstanciado justificando a adoção do percentual de cada parcela do BDI.",null,null,null,null,null,null,null,null,null,null,null,false,"anexo apresentado"]
[]
[null,null,null,null,null,null,null,null,"Os valores de BDI foram calculados com o emprego da fórmula:"]
[{"$f":"A29","v":"Obras Portuárias, Marítimas e Fluviais"},"DF","Obras Portuárias, Marítimas e Fluviais-DF",null,9.3999999999999986E-3,1.0200000000000001E-2,1.3300000000000001E-2,null,null,null,null,{"$f":"IF(Q11=\"Sim\",\"BDI.DES =\",\"BDI.PAD =\")","v":"BDI.DES ="},{"$f":"IF($I$11=$A$59,\"(1+K1+K2)*(1+K3)\",\"(1+AC + S + R + G)*(1 + DF)*(1+L)\")","v":"(1+AC + S + R + G)*(1 + DF)*(1+L)"},null,null," - 1"]
[{"$f":"A32","v":"Obras Portuárias, Marítimas e Fluviais"},"L","Obras Portuárias, Marítimas e Fluviais-L",null,7.1399999999999991E-2,8.4000000000000005E-2,0.1043,null,null,null,null,null,{"$f":"IF(Q11=\"Sim\",\"(1-CP-ISS-CRPB)\",\"(1-CP-ISS)\")","v":"(1-CP-ISS-CRPB)"}]
[{"$f":"A33","v":"Obras Portuárias, Marítimas e Fluviais"},"BDI PAD","Obras Portuárias, Marítimas e Fluviais-BDI PAD",null,0.22800000000000001,0.27479999999999999,0.3095]
[null,null,null,null,null,null,null,null,{"$f":"CONCATENATE(\"Declaro para os devidos fins que, conforme legislação tributária municipal, a base de cálculo para \",I11,\", é de \",Q13*100,\"%, com a respectiva alíquota de \",Q14*100,\"%.\")","v":"Declaro para os devidos fins que, conforme legislação tributária municipal, a base de cálculo para Fornecimento de Materiais e Equipamentos (aquisição direta), é de 100%, com a respectiva alíquota de 2%."}]
[]
[null,null,null,null,null,null,null,null,{"$f":"CONCATENATE(\"Declaro para os devidos fins que o regime de Contribuição Previdenciária sobre a Receita Bruta adotado para elaboração do orçamento foi \",IF(Q11=\"Sim\",\"COM\",\"SEM\"),\" Desoneração, e que esta é a alternativa mais adequada para a Administração Pública.\")","v":"Declaro para os devidos fins que o regime de Contribuição Previdenciária sobre a Receita Bruta adotado para elaboração do orçamento foi COM Desoneração, e que esta é a alternativa mais adequada para a Administração Pública."}]
["Fornecimento de Materiais e Equipamentos (aquisição indireta - em conjunto com licitação de obras)","AC","Fornecimento de Materiais e Equipamentos (aquisição indireta - em conjunto com licitação de obras)-AC",null,1.4999999999999999E-2,3.4500000000000003E-2,4.4900000000000002E-2]
[{"$f":"A38","v":"Fornecimento de Materiais e Equipamentos (aquisição indireta - em conjunto com licitação de obras)"},"SG","Fornecimento de Materiais e Equipamentos (aquisição indireta - em conjunto com licitação de obras)-SG",null,3.0000000000000001E-3,4.7999999999999996E-3,8.199999999999999E-3,null,"Observações:"]
[{"$f":"A39","v":"Fornecimento de Materiais e Equipamentos (aquisição indireta - em conjunto com licitação de obras)"},"R","Fornecimento de Materiais e Equipamentos (aquisição indireta - em conjunto com licitação de obras)-R",null,5.6000000000000008E-3,8.5000000000000006E-3,8.8999999999999999E-3]
[{"$f":"A40","v":"Fornecimento de Materiais e Equipamentos (aquisição indireta - em conjunto com licitação de obras)"},"DF","Fornecimento de Materiais e Equipamentos (aquisição indireta - em conjunto com licitação de obras)-DF",null,8.5000000000000006E-3,8.5000000000000006E-3,1.11E-2]
[{"$f":"A41","v":"Fornecimento de Materiais e Equipamentos (aquisição indireta - em conjunto com licitação de obras)"},"L","Fornecimento de Materiais e Equipamentos (aquisição indireta - em conjunto com licitação de obras)-L",null,3.5000000000000003E-2,5.1100000000000007E-2,6.2199999999999998E-2,null,{"$f":"PO!K156","v":"SÃO JOSÉ DO OURO / RS"},null,null,null,null,null,{"$f":"PO!K159","v":"2025-11-02"}]
[{"$f":"A42","v":"Fornecimento de Materiais e Equipamentos (aquisição indireta - em conjunto com licitação de obras)"},"BDI PAD","Fornecimento de Materiais e Equipamentos (aquisição indireta - em conjunto com licitação de obras)-BDI PAD",null,0.111,0.14019999999999999,0.16800000000000001,null,"Local",null,null,null,null,null,"Data"]
["Estudos e Projetos, Planos e Gerenciamento e outros correlatos","K1","Estudos e Projetos, Planos e Gerenciamento e outros correlatos-K1",null,"-","-","-"]
[{"$f":"A44","v":"Estudos e Projetos, Planos e Gerenciamento e outros correlatos"},"K2","Estudos e Projetos, Planos e Gerenciamento e outros correlatos-K2",null,"-",0.2,"-"]
[{"$f":"A45","v":"Estudos e Projetos, Planos e Gerenciamento e outros correlatos"},"","Estudos e Projetos, Planos e Gerenciamento e outros correlatos-",null,"-","-","-",null,"Responsável Técnico",null,null,null,null,null,"Responsável Tomador"]
[{"$f":"A46","v":"Estudos e Projetos, Planos e Gerenciamento e outros correlatos"},"","Estudos e Projetos, Planos e Gerenciamento e outros correlatos-",null,"-","-","-",null,"Nome:",{"$f":"DADOS!B54","v":"LEONARDO CONSORTE"},null,null,null,null,"Nome:","Antônio José Bianchin"]
[{"$f":"A47","v":"Estudos e Projetos, Planos e Gerenciamento e outros correlatos"},"K3","Estudos e Projetos, Planos e Gerenciamento e outros correlatos-K3",null,"-",0.12,"-",null,"Título:",{"$f":"DADOS!B55","v":"ENG. CIVIL"},null,null,null,null,"Cargo:","Prefeito Munipal"]
[{"$f":"A48","v":"Estudos e Projetos, Planos e Gerenciamento e outros correlatos"},"BDI PAD","Estudos e Projetos, Planos e Gerenciamento e outros correlatos-BDI PAD",null,"-","-","-",null,{"$f":"DADOS!A56","v":"CREA/CAU:"},{"$f":"DADOS!B56","v":"1331921"}]
[null,null,null,null,null,null,null,null,{"$f":"DADOS!A57","v":"ART/RRT:"},{"$f":"DADOS!B57","v":"13901876"}]
[]
["Construção e Reforma de Edifícios"]
["Construção de Praças Urbanas, Rodovias, Ferrovias e recapeamento e pavimentação de vias urbanas"]
["Construção de Redes de Abastecimento de Água, Coleta de Esgoto"]
["Construção e Manutenção de Estações e Redes de Distribuição de Energia Elétrica"]
["Obras Portuárias, Marítimas e Fluviais"]
["Fornecimento de Materiais e Equipamentos (aquisição indireta - em conjunto com licitação de obras)"]
["Fornecimento de Materiais e Equipamentos (aquisição direta)"]
["Estudos e Projetos, Planos e Gerenciamento e outros correlatos"]

{"sheet":"BDI (4)","index":4,"n_rows":59,"n_cols":23,"rows_kept":59,"cut":false,"hidden":false,"merged":[[48,9,48,11],[49,9,49,11],[45,8,45,11],[45,14,45,17],[46,9,46,11],[46,15,46,17],[47,9,47,11],[47,15,47,17],[39,8,39,17],[41,8,41,11],[41,14,41,17],[42,8,42,11],[44,8,44,11],[44,14,44,17],[36,8,36,17],[24,8,24,11],[25,8,25,11],[26,8,26,11],[26,15,26,17],[28,9,28,17],[30,8,30,17],[31,11,32,11],[31,12,31,14],[31,15,32,15],[32,12,32,14],[34,8,34,17],[15,19,23,20],[17,8,17,11],[18,8,18,11],[19,8,19,11],[20,8,20,11],[21,8,21,11],[22,8,22,11],[23,8,23,11],[13,8,13,15],[13,16,13,17],[15,8,16,11],[15,12,16,12],[15,13,16,13],[15,14,16,14],[15,15,16,15],[15,16,16,16],[15,17,16,17],[9,8,9,15],[9,16,9,17],[10,8,10,15],[10,16,10,17],[12,8,12,15],[12,16,12,17],[7,8,7,17],[3,8,3,9],[3,10,3,17],[4,8,4,9],[4,10,4,17],[6,8,6,17]]}
[null,null,null,null,"MIN","MED","MAX",null,null,null,null,null,null,{"$f":"\"Quadro de Composição do BDI \"&MID(CELL(\"nome.arquivo\",N1),5+FIND(\"BDI (\",CELL(\"nome.arquivo\",N1)),1)","v":"Quadro de Composição do BDI 4"}]
["Construção e Reforma de Edifícios","AC",{"$f":"CONCATENATE(A2,\"-\",B2)","v":"Construção e Reforma de Edifícios-AC"},null,0.03,0.04,5.5E-2]
[{"$f":"A2","v":"Construção e Reforma de Edifícios"},"SG","Construção e Reforma de Edifícios-SG",null,8.0000000000000002E-3,8.0000000000000002E-3,0.01]
[{"$f":"A3","v":"Construção e Reforma de Edifícios"},"R","Construção e Reforma de Edifícios-R",null,9.7000000000000003E-3,1.2699999999999999E-2,1.2699999999999999E-2,null,"Nº TC/CR",null,"PROPONENTE / TOMADOR"]
[{"$f":"A4","v":"Construção e Reforma de Edifícios"},"DF","Construção e Reforma de Edifícios-DF",null,5.8999999999999999E-3,1.23E-2,1.3899999999999999E-2,null,{"$f":"DADOS!A29","v":"-"},null,{"$f":"DADOS!A32","v":"CÂMARA DE VEREADORES DE SÃO JOSÉ DO OURO"}]
[{"$f":"A5","v":"Construção e Reforma de Edifícios"},"L","Construção e Reforma de Edifícios-L",null,6.1600000000000002E-2,7.400000000000001E-2,8.9600000000000013E-2]
[{"$f":"A6","v":"Construção e Reforma de Edifícios"},"BDI PAD","Construção e Reforma de Edifícios-BDI PAD",null,0.2034,0.22120000000000001,0.25,null,"OBJETO"]
["Construção de Praças Urbanas, Rodovias, Ferrovias e recapeamento e pavimentação de vias urbanas","AC","Construção de Praças Urbanas, Rodovias, Ferrovias e recapeamento e pavimentação de vias urbanas-AC",null,3.7999999999999999E-2,4.0099999999999997E-2,4.6699999999999998E-2,null,{"$f":"DADOS!P29","v":"REFORMA DA CÂMARA DE VEREADORES DE SÃO JOSÉ DO OURO"}]
["Construção de Praças Urbanas, Rodovias, Ferrovias e recapeamento e pavimentação de vias urbanas","SG","Construção de Praças Urbanas, Rodovias, Ferrovias e recapeamento e pavimentação de vias urbanas-SG",null,3.2000000000000002E-3,4.0000000000000001E-3,7.4000000000000003E-3]
["Construção de Praças Urbanas, Rodovias, Ferrovias e recapeamento e pavimentação de vias urbanas","R","Construção de Praças Urbanas, Rodovias, Ferrovias e recapeamento e pavimentação de vias urbanas-R",null,5.0000000000000001E-3,5.6000000000000008E-3,9.7000000000000003E-3,null,"TIPO DE OBRA DO EMPREENDIMENTO",null,null,null,null,null,null,null,"DESONERAÇÃO"]
["Construção de Praças Urbanas, Rodovias, Ferrovias e recapeamento e pavimentação de vias urbanas","DF","Construção de Praças Urbanas, Rodovias, Ferrovias e recapeamento e pavimentação de vias urbanas-DF",null,1.0200000000000001E-2,1.11E-2,1.21E-2,null,"Fornecimento de Materiais e Equipamentos (aquisição direta)",null,null,null,null,null,null,null,{"$f":"DADOS!$C$38","v":"Sim"}]
["Construção de Praças Urbanas, Rodovias, Ferrovias e recapeamento e pavimentação de vias urbanas","L","Construção de Praças Urbanas, Rodovias, Ferrovias e recapeamento e pavimentação de vias urbanas-L",null,6.6400000000000001E-2,7.2999999999999995E-2,8.6899999999999991E-2]
["Construção de Praças Urbanas, Rodovias, Ferrovias e recapeamento e pavimentação de vias urbanas","BDI PAD","Construção de Praças Urbanas, Rodovias, Ferrovias e recapeamento e pavimentação de vias urbanas-BDI PAD",null,0.19600000000000001,0.2097,0.24230000000000002,null,"Conforme legislação tributária municipal, definir estimativa de percentual da base de cálculo para o ISS:",null,null,null,null,null,null,null,1]
["Construção de Redes de Abastecimento de Água, Coleta de Esgoto","AC","Construção de Redes de Abastecimento de Água, Coleta de Esgoto-AC",null,3.4300000000000004E-2,4.9299999999999997E-2,6.7099999999999993E-2,null,"Sobre a base de cálculo, definir a respectiva alíquota do ISS (entre 2% e 5%):",null,null,null,null,null,null,null,0.02]
[{"$f":"A14","v":"Construção de Redes de Abastecimento de Água, Coleta de Esgoto"},"SG","Construção de Redes de Abastecimento de Água, Coleta de Esgoto-SG",null,2.8000000000000004E-3,4.8999999999999998E-3,7.4999999999999997E-3]
[null,null,null,null,null,null,null,null,"Itens",null,null,null,"Siglas","% Adotado","Situação","1º Quartil","Médio","3º Quartil",null,{"$f":"IF(V27,\"Para BDI fora do intervalo estatístico, deve ser apresentado Relatório Técnico Circunstanciado justificando a adoção do percentual de cada parcela do BDI.\",\"\")","v":""}]
[{"$f":"A15","v":"Construção de Redes de Abastecimento de Água, Coleta de Esgoto"},"R","Construção de Redes de Abastecimento de Água, Coleta de Esgoto-R",null,0.01,1.3899999999999999E-2,1.7399999999999999E-2]
[{"$f":"A17","v":"Construção de Redes de Abastecimento de Água, Coleta de Esgoto"},"DF","Construção de Redes de Abastecimento de Água, Coleta de Esgoto-DF",null,9.3999999999999986E-3,9.8999999999999991E-3,1.1699999999999999E-2,null,{"$f":"IF($I$11=$A$59,\"Encargos Sociais incidentes sobre a mão de obra\",\"Administração Central\")","v":"Administração Central"},null,null,null,{"$f":"IF($I$11=$A$59,\"K1\",\"AC\")","v":"AC"},null,"-",{"$f":"VLOOKUP(CONCATENATE(I$11,\"-\",M18),$C$2:$G$49,3,FALSE)","v":{"$error":"#N/A"}},{"$f":"VLOOKUP(CONCATENATE(I$11,\"-\",M18),$C$2:$G$49,4,FALSE)","v":{"$error":"#N/A"}},{"$f":"VLOOKUP(CONCATENATE(I$11,\"-\",M18),$C$2:$G$49,5,FALSE)","v":{"$error":"#N/A"}}]
[{"$f":"A18","v":"Construção de Redes de Abastecimento de Água, Coleta de Esgoto"},"L","Construção de Redes de Abastecimento de Água, Coleta de Esgoto-L",null,6.7400000000000002E-2,8.0399999999999985E-2,9.4E-2,null,{"$f":"IF($I$11=$A$59,\"Administração Central da empresa ou consultoria - overhead\",\"Seguro e Garantia\")","v":"Seguro e Garantia"},null,null,null,{"$f":"IF($I$11=$A$59,\"K2\",\"SG\")","v":"SG"},null,"-",{"$f":"VLOOKUP(CONCATENATE(I$11,\"-\",M19),$C$2:$G$49,3,FALSE)","v":{"$error":"#N/A"}},{"$f":"VLOOKUP(CONCATENATE(I$11,\"-\",M19),$C$2:$G$49,4,FALSE)","v":{"$error":"#N/A"}},{"$f":"VLOOKUP(CONCATENATE(I$11,\"-\",M19),$C$2:$G$49,5,FALSE)","v":{"$error":"#N/A"}}]
[{"$f":"A19","v":"Construção de Redes de Abastecimento de Água, Coleta de Esgoto"},"BDI PAD","Construção de Redes de Abastecimento de Água, Coleta de Esgoto-BDI PAD",null,0.20760000000000001,0.24179999999999999,0.26440000000000002,null,{"$f":"IF($I$11=$A$59,\"\",\"Risco\")","v":"Risco"},null,null,null,{"$f":"IF($I$11=$A$59,\"\",\"R\")","v":"R"},null,"-",{"$f":"VLOOKUP(CONCATENATE(I$11,\"-\",M20),$C$2:$G$49,3,FALSE)","v":{"$error":"#N/A"}},{"$f":"VLOOKUP(CONCATENATE(I$11,\"-\",M20),$C$2:$G$49,4,FALSE)","v":{"$error":"#N/A"}},{"$f":"VLOOKUP(CONCATENATE(I$11,\"-\",M20),$C$2:$G$49,5,FALSE)","v":{"$error":"#N/A"}}]
["Construção e Manutenção de Estações e Redes de Distribuição de Energia Elétrica","AC","Construção e Manutenção de Estações e Redes de Distribuição de Energia Elétrica-AC",null,5.2900000000000003E-2,5.9200000000000003E-2,7.9299999999999995E-2,null,{"$f":"IF($I$11=$A$59,\"\",\"Despesas Financeiras\")","v":"Despesas Financeiras"},null,null,null,{"$f":"IF($I$11=$A$59,\"\",\"DF\")","v":"DF"},null,"-",{"$f":"VLOOKUP(CONCATENATE(I$11,\"-\",M21),$C$2:$G$49,3,FALSE)","v":{"$error":"#N/A"}},{"$f":"VLOOKUP(CONCATENATE(I$11,\"-\",M21),$C$2:$G$49,4,FALSE)","v":{"$error":"#N/A"}},{"$f":"VLOOKUP(CONCATENATE(I$11,\"-\",M21),$C$2:$G$49,5,FALSE)","v":{"$error":"#N/A"}}]
[{"$f":"A21","v":"Construção e Manutenção de Estações e Redes de Distribuição de Energia Elétrica"},"SG","Construção e Manutenção de Estações e Redes de Distribuição de Energia Elétrica-SG",null,2.5000000000000001E-3,5.1000000000000004E-3,5.6000000000000008E-3,null,{"$f":"IF($I$11=$A$59,\"Margem bruta da empresa de consultoria\",\"Lucro\")","v":"Lucro"},null,null,null,{"$f":"IF($I$11=$A$59,\"K3\",\"L\")","v":"L"},null,"-",{"$f":"VLOOKUP(CONCATENATE(I$11,\"-\",M22),$C$2:$G$49,3,FALSE)","v":{"$error":"#N/A"}},{"$f":"VLOOKUP(CONCATENATE(I$11,\"-\",M22),$C$2:$G$49,4,FALSE)","v":{"$error":"#N/A"}},{"$f":"VLOOKUP(CONCATENATE(I$11,\"-\",M22),$C$2:$G$49,5,FALSE)","v":{"$error":"#N/A"}}]
[{"$f":"A22","v":"Construção e Manutenção de Estações e Redes de Distribuição de Energia Elétrica"},"R","Construção e Manutenção de Estações e Redes de Distribuição de Energia Elétrica-R",null,0.01,1.4800000000000001E-2,1.9699999999999999E-2,null,"Tributos (impostos COFINS 3%, e  PIS 0,65%)",null,null,null,"CP",null,"-",3.6499999999999998E-2,3.6499999999999998E-2,3.6499999999999998E-2]
[{"$f":"A23","v":"Construção e Manutenção de Estações e Redes de Distribuição de Energia Elétrica"},"DF","Construção e Manutenção de Estações e Redes de Distribuição de Energia Elétrica-DF",null,1.01E-2,1.0700000000000001E-2,1.11E-2,null,"Tributos (ISS, variável de acordo com o município)",null,null,null,"ISS",{"$f":"IF($I$11<>$A$58,Q14*Q13,0)","v":0},"-",0,2.5000000000000001E-2,0.05]
[{"$f":"A24","v":"Construção e Manutenção de Estações e Redes de Distribuição de Energia Elétrica"},"L","Construção e Manutenção de Estações e Redes de Distribuição de Energia Elétrica-L",null,0.08,8.3100000000000007E-2,9.5100000000000004E-2,null,"Tributos (Contribuição Previdenciária sobre a Receita Bruta - 0% ou 4,5% - Desoneração)",null,null,null,"CPRB",{"$f":"IF(AND($I$11<>$A$58,Q11=\"Sim\"),4.5%,0%)","v":0},{"$f":"IF(AND(N25>=P25, N25<=R25), \"OK\", \"Não OK\")","v":"OK"},0,4.4999999999999998E-2,4.4999999999999998E-2]
[{"$f":"A25","v":"Construção e Manutenção de Estações e Redes de Distribuição de Energia Elétrica"},"BDI PAD","Construção e Manutenção de Estações e Redes de Distribuição de Energia Elétrica-BDI PAD",null,0.24,0.25840000000000002,0.27860000000000001,null,"BDI SEM desoneração\n(Fórmula Acórdão TCU)",null,null,null,"BDI PAD",{"$f":"IF($I$11=$A$58,0,ROUND((((1+N18+N19+N20)*(1+N21)*(1+N22)/(1-(N23+N24)))-1),4))","v":0},{"$f":"IF(OR($I$11=$A$59,$I$11=$A$58,AND(N26>=P26, N26<=R26)), \"OK\", \"FORA DO INTERVALO\")","v":"OK"},{"$f":"IF($I$11=$A$58,0,VLOOKUP(CONCATENATE($I$11,\"-\",$M26),$C$2:$G$49,3,FALSE))","v":0},{"$f":"IF($I$11=$A$58,0,VLOOKUP(CONCATENATE($I$11,\"-\",$M26),$C$2:$G$49,4,FALSE))","v":0},{"$f":"IF($I$11=$A$58,0,VLOOKUP(CONCATENATE($I$11,\"-\",$M26),$C$2:$G$49,5,FALSE))","v":0}]
["Obras Portuárias, Marítimas e Fluviais","AC","Obras Portuárias, Marítimas e Fluviais-AC",null,0.04,5.5199999999999999E-2,7.85E-2,null,"BDI COM desoneração",null,null,null,"BDI DES",{"$f":"IF($I$11=$A$58,0,ROUND((((1+N18+N19+N20)*(1+N21)*(1+N22)/(1-(N23+N24+N25)))-1),4))","v":0},{"$f":"IF(Q11<>\"Sim\",\"\",O26)","v":"OK"},null,null,null,null,null,null,{"$f":"AND(COUNTA(N18:N23)=6,O26<>\"ok\",NOT(V29))","v":false},"pedir anexo"]
[{"$f":"A27","v":"Obras Portuárias, Marítimas e Fluviais"},"SG","Obras Portuárias, Marítimas e Fluviais-SG",null,8.1000000000000013E-3,1.2199999999999999E-2,1.9900000000000001E-2]
[{"$f":"A28","v":"Obras Portuárias, Marítimas e Fluviais"},"R","Obras Portuárias, Marítimas e Fluviais-R",null,1.46E-2,2.3199999999999998E-2,3.1600000000000003E-2,null,{"$f":"IF(V29,\"X\",\"\")","v":""},"Anexo: Relatório Técnico Circunstanciado justificando a adoção do percentual de cada parcela do BDI.",null,null,null,null,null,null,null,null,null,null,null,false,"anexo apresentado"]
[]
[null,null,null,null,null,null,null,null,"Os valores de BDI foram calculados com o emprego da fórmula:"]
[{"$f":"A29","v":"Obras Portuárias, Marítimas e Fluviais"},"DF","Obras Portuárias, Marítimas e Fluviais-DF",null,9.3999999999999986E-3,1.0200000000000001E-2,1.3300000000000001E-2,null,null,null,null,{"$f":"IF(Q11=\"Sim\",\"BDI.DES =\",\"BDI.PAD =\")","v":"BDI.DES ="},{"$f":"IF($I$11=$A$59,\"(1+K1+K2)*(1+K3)\",\"(1+AC + S + R + G)*(1 + DF)*(1+L)\")","v":"(1+AC + S + R + G)*(1 + DF)*(1+L)"},null,null," - 1"]
[{"$f":"A32","v":"Obras Portuárias, Marítimas e Fluviais"},"L","Obras Portuárias, Marítimas e Fluviais-L",null,7.1399999999999991E-2,8.4000000000000005E-2,0.1043,null,null,null,null,null,{"$f":"IF(Q11=\"Sim\",\"(1-CP-ISS-CRPB)\",\"(1-CP-ISS)\")","v":"(1-CP-ISS-CRPB)"}]
[{"$f":"A33","v":"Obras Portuárias, Marítimas e Fluviais"},"BDI PAD","Obras Portuárias, Marítimas e Fluviais-BDI PAD",null,0.22800000000000001,0.27479999999999999,0.3095]
[null,null,null,null,null,null,null,null,{"$f":"CONCATENATE(\"Declaro para os devidos fins que, conforme legislação tributária municipal, a base de cálculo para \",I11,\", é de \",Q13*100,\"%, com a respectiva alíquota de \",Q14*100,\"%.\")","v":"Declaro para os devidos fins que, conforme legislação tributária municipal, a base de cálculo para Fornecimento de Materiais e Equipamentos (aquisição direta), é de 100%, com a respectiva alíquota de 2%."}]
[]
[null,null,null,null,null,null,null,null,{"$f":"CONCATENATE(\"Declaro para os devidos fins que o regime de Contribuição Previdenciária sobre a Receita Bruta adotado para elaboração do orçamento foi \",IF(Q11=\"Sim\",\"COM\",\"SEM\"),\" Desoneração, e que esta é a alternativa mais adequada para a Administração Pública.\")","v":"Declaro para os devidos fins que o regime de Contribuição Previdenciária sobre a Receita Bruta adotado para elaboração do orçamento foi COM Desoneração, e que esta é a alternativa mais adequada para a Administração Pública."}]
["Fornecimento de Materiais e Equipamentos (aquisição indireta - em conjunto com licitação de obras)","AC","Fornecimento de Materiais e Equipamentos (aquisição indireta - em conjunto com licitação de obras)-AC",null,1.4999999999999999E-2,3.4500000000000003E-2,4.4900000000000002E-2]
[{"$f":"A38","v":"Fornecimento de Materiais e Equipamentos (aquisição indireta - em conjunto com licitação de obras)"},"SG","Fornecimento de Materiais e Equipamentos (aquisição indireta - em conjunto com licitação de obras)-SG",null,3.0000000000000001E-3,4.7999999999999996E-3,8.199999999999999E-3,null,"Observações:"]
[{"$f":"A39","v":"Fornecimento de Materiais e Equipamentos (aquisição indireta - em conjunto com licitação de obras)"},"R","Fornecimento de Materiais e Equipamentos (aquisição indireta - em conjunto com licitação de obras)-R",null,5.6000000000000008E-3,8.5000000000000006E-3,8.8999999999999999E-3]
[{"$f":"A40","v":"Fornecimento de Materiais e Equipamentos (aquisição indireta - em conjunto com licitação de obras)"},"DF","Fornecimento de Materiais e Equipamentos (aquisição indireta - em conjunto com licitação de obras)-DF",null,8.5000000000000006E-3,8.5000000000000006E-3,1.11E-2]
[{"$f":"A41","v":"Fornecimento de Materiais e Equipamentos (aquisição indireta - em conjunto com licitação de obras)"},"L","Fornecimento de Materiais e Equipamentos (aquisição indireta - em conjunto com licitação de obras)-L",null,3.5000000000000003E-2,5.1100000000000007E-2,6.2199999999999998E-2,null,{"$f":"PO!K156","v":"SÃO JOSÉ DO OURO / RS"},null,null,null,null,null,{"$f":"PO!K159","v":"2025-11-02"}]
[{"$f":"A42","v":"Fornecimento de Materiais e Equipamentos (aquisição indireta - em conjunto com licitação de obras)"},"BDI PAD","Fornecimento de Materiais e Equipamentos (aquisição indireta - em conjunto com licitação de obras)-BDI PAD",null,0.111,0.14019999999999999,0.16800000000000001,null,"Local",null,null,null,null,null,"Data"]
["Estudos e Projetos, Planos e Gerenciamento e outros correlatos","K1","Estudos e Projetos, Planos e Gerenciamento e outros correlatos-K1",null,"-","-","-"]
[{"$f":"A44","v":"Estudos e Projetos, Planos e Gerenciamento e outros correlatos"},"K2","Estudos e Projetos, Planos e Gerenciamento e outros correlatos-K2",null,"-",0.2,"-"]
[{"$f":"A45","v":"Estudos e Projetos, Planos e Gerenciamento e outros correlatos"},"","Estudos e Projetos, Planos e Gerenciamento e outros correlatos-",null,"-","-","-",null,"Responsável Técnico",null,null,null,null,null,"Responsável Tomador"]
[{"$f":"A46","v":"Estudos e Projetos, Planos e Gerenciamento e outros correlatos"},"","Estudos e Projetos, Planos e Gerenciamento e outros correlatos-",null,"-","-","-",null,"Nome:",{"$f":"DADOS!B54","v":"LEONARDO CONSORTE"},null,null,null,null,"Nome:"]
[{"$f":"A47","v":"Estudos e Projetos, Planos e Gerenciamento e outros correlatos"},"K3","Estudos e Projetos, Planos e Gerenciamento e outros correlatos-K3",null,"-",0.12,"-",null,"Título:",{"$f":"DADOS!B55","v":"ENG. CIVIL"},null,null,null,null,"Cargo:"]
[{"$f":"A48","v":"Estudos e Projetos, Planos e Gerenciamento e outros correlatos"},"BDI PAD","Estudos e Projetos, Planos e Gerenciamento e outros correlatos-BDI PAD",null,"-","-","-",null,{"$f":"DADOS!A56","v":"CREA/CAU:"},{"$f":"DADOS!B56","v":"1331921"}]
[null,null,null,null,null,null,null,null,{"$f":"DADOS!A57","v":"ART/RRT:"},{"$f":"DADOS!B57","v":"13901876"}]
[]
["Construção e Reforma de Edifícios"]
["Construção de Praças Urbanas, Rodovias, Ferrovias e recapeamento e pavimentação de vias urbanas"]
["Construção de Redes de Abastecimento de Água, Coleta de Esgoto"]
["Construção e Manutenção de Estações e Redes de Distribuição de Energia Elétrica"]
["Obras Portuárias, Marítimas e Fluviais"]
["Fornecimento de Materiais e Equipamentos (aquisição indireta - em conjunto com licitação de obras)"]
["Fornecimento de Materiais e Equipamentos (aquisição direta)"]
["Estudos e Projetos, Planos e Gerenciamento e outros correlatos"]

{"sheet":"PO","index":5,"n_rows":160,"n_cols":26,"rows_kept":160,"cut":false,"hidden":false,"merged":[[1,22,1,23],[152,10,152,19],[148,10,150,19],[145,12,145,19],[158,10,158,12],[155,10,155,12]]}
[null,null,null,null,null,null,null,null,null,null,null,null,null,"PO - PLANILHA ORÇAMENTÁRIA",null,null,null,null,null,"Grau de Sigilo"]
[null,"LOTE","Meta","Nível 2","Nível 3","Nível 4","Serviço",null,null,null,null,null,null,{"$f":"CHOOSE(1+LOG(1+2*(TipoOrçamento=\"BASE\")+4*(TipoOrçamento=\"LICITADO\")+8*(TipoOrçamento=\"REPROGRAMADOAC\")+16*(TipoOrçamento=\"REPROGRAMADONPL\"),2),\"nada\",\"Orçamento Base para Licitação\",\"Orçamento Licitado\",\"Orçamento Licitado Reprogramado\",\"Orçamento Base para Licitação - Reprogramado\")","v":"Orçamento Base para Licitação"},null,null,null,null,null,"#PUBLICO",null,null,"Arredondamento"]
[null,null,null,null,null,null,null,null,null,null,null,null,null,null,null,null,null,null,null,null,null,null,"Quantidade",true]
["Nmax",null,null,null,null,null,null,null,null,null,null,null,null,null,null,null,null,null,null,null,"ERRO GERAL",null,"Custo Unitáro",true]
[{"$f":"MAX($A$12:$A$145)","v":4},null,null,null,null,null,null,null,null,null,null,null,null,null,null,null,null,null,null,null,{"$f":"IF(COUNTIF($U$12:OFFSET($U$145,-1,0),\"DESCRIÇÃO\")+COUNTIF($U$12:OFFSET($U$145,-1,0),\"UNIDADE\")+COUNTIF($U$12:OFFSET($U$145,-1,0),\"SEM VALOR\")>0,\"NÃO OK\",\"OK\")","v":"NÃO OK"},"","BDI",true]
[null,null,null,null,null,null,null,null,null,null,null,null,null,null,null,null,null,null,null,null,null,null,"Preço Unitário",true]
[null,null,null,null,null,null,null,null,null,null,null,null,null,null,null,null,null,null,null,null,null,null,"Preço Total",true]
[]
[null,null,null,null,null,null,null,null,null,null,null,null,null,null,null,{"$f":"OFFSET(PLQ!$E$12,ROW($P9)-ROW(P$12),0)","v":"-"}]
["Nível","Altura","n1","n2","n3","n4","n5","Czero","Cnível","Nível","Item","Fonte","Código","Descrição","Unidade","Quantidade",{"$f":"IF(OR(TipoOrçamento=\"LICITADO\",TipoOrçamento=\"REPROGRAMADOAC\"),\"Preço Unitário (R$)\",\"Custo Unitário (R$)\")","v":"Custo Unitário (R$)"},"BDI\n(%)","Preço Unitário (R$)","Preço Total\n(R$)","Erro de Dados","Lista Crono","Concatenação Fonte-Código","BancoRef",{"$f":"IF(TipoOrçamento=\"LICITADO\",\"Preço Unitário Edital (R$)\",\"Custo Unitário Referência (R$)\")","v":"Custo Unitário Referência (R$)"},{"$f":"IF(TipoOrçamento=\"LICITADO\",\"Valor BDI Edital\",\"Valor BDI\")","v":"Valor BDI"}]
[{"$f":"CHOOSE(1+LOG(1+2*(J11=\"Meta\")+4*(J11=\"Nível 2\")+8*(J11=\"Nível 3\")+16*(J11=\"Nível 4\")+32*(J11=\"Serviço\"),2),0,1,2,3,4,\"S\")","v":"S"},{"$f":"IF(OR(A11=\"S\",A11=0),0,IF(ISERROR(I11),H11,SMALL(H11:I11,1)))","v":0},{"$f":"IF($A11=1,OFFSET(C11,-1,0)+1,OFFSET(C11,-1,0))","v":"n1"},{"$f":"IF($A11=1,0,IF($A11=2,OFFSET(D11,-1,0)+1,OFFSET(D11,-1,0)))","v":"n2"},{"$f":"IF(AND($A11<=2,$A11<>0),0,IF($A11=3,OFFSET(E11,-1,0)+1,OFFSET(E11,-1,0)))","v":"n3"},{"$f":"IF(AND($A11<=3,$A11<>0),0,IF($A11=4,OFFSET(F11,-1,0)+1,OFFSET(F11,-1,0)))","v":"n4"},{"$f":"IF(AND($A11<=4,$A11<>0),0,IF($A11=\"S\",OFFSET(G11,-1,0)+1,OFFSET(G11,-1,0)))","v":{"$error":"#VALUE!"}},{"$f":"IF(OR($A11=\"S\",$A11=0),0,MATCH(0,OFFSET($B11,1,$A11,ROW($A$145)-ROW($A11)),0))","v":0},{"$f":"IF(OR($A11=\"S\",$A11=0),0,MATCH(OFFSET($B11,0,$A11)+1,OFFSET($B11,1,$A11,ROW($A$145)-ROW($A11)),0))","v":0},"Serviço",{"$f":"IF($A11=0,\"-\",CONCATENATE(C11&\".\",IF(AND($A$5>=2,$A11>=2),D11&\".\",\"\"),IF(AND($A$5>=3,$A11>=3),E11&\".\",\"\"),IF(AND($A$5>=4,$A11>=4),F11&\".\",\"\"),IF($A11=\"S\",G11&\".\",\"\")))","v":{"$error":"#VALUE!"}},null,null,{"$f":"IF($A11=\"S\",Referencia.Descricao,\"(digite a descrição aqui)\")","v":""},{"$f":"Referencia.Unidade","v":""},{"$f":"OFFSET(PLQ!$E$12,ROW($P11)-ROW(P$12),0)","v":0},null,"BDI 1",{"$f":"IF($A11=\"S\",IF($Q$10=\"Preço Unitário (R$)\",PO.CustoUnitario,ROUND(PO.CustoUnitario*(1+$Z11),15-13*$X$6)),0)","v":0},{"$f":"IF($A11=\"S\",VTOTAL1,IF($A11=0,0,ROUND(SomaAgrup,15-13*$X$7)))","v":0},{"$f":"IF($J11=\"\",\"\",IF($N11=\"\",\"DESCRIÇÃO\",IF(AND($J11=\"Serviço\",$O11=\"\"),\"UNIDADE\",IF($T11<=0,\"SEM VALOR\",IF(AND($Y11<>\"\",$Q11>$Y11),\"ACIMA REF.\",\"\")))))","v":"DESCRIÇÃO"},{"$f":"IF(OR($A11=0,$A11=\"S\",$A11>CFF!$A$9),\"\",MAX(V$12:OFFSET(V11,-1,0))+1)","v":""},{"$f":"IF(AND($J11=\"Serviço\",$M11<>\"\"),IF($L11=\"\",$M11,CONCATENATE($L11,\"-\",$M11)))","v":false},{"$f":"IF(AND(Fonte<>\"\",Código<>\"\"),MATCH(Fonte&\" \"&IF(Fonte=\"sinapi\",SUBSTITUTE(SUBSTITUTE(Código,\"/00\",\"/\"),\"/0\",\"/\"),Código),INDIRECT(\"'[Referência \"&_xlnm.Database&\".xls]Banco'!$a:$a\"),0),\"X\")","v":"X"},{"$f":"IF(Import.Desoneracao=\"sim\",Referencia.Desonerado,Referencia.NaoDesonerado)","v":0},{"$f":"ROUND(IF(ISNUMBER(R11),R11,IF(LEFT(R11,3)=\"BDI\",HLOOKUP(R11,DADOS!$T$37:$X$38,2,FALSE),0)),15-11*$X$5)","v":0.30209999999999998}]
[0,{"$f":"COUNTA(OFFSET(B12,1,0):B$145)","v":132},null,null,null,null,null,null,null,{"$f":"IF(OR(TipoOrçamento=\"LICITADO\",TipoOrçamento=\"REPROGRAMADOAC\"),\"CTEF\",\"LOTE\")","v":"LOTE"},0,null,null,{"$f":"IF(TipoOrçamento=\"LICITADO\",DADOS!O43,DADOS!G38)","v":"REFORMA DA CÂMARA DE VEREADORES DE SÃO JOSÉ DO OURO"},null,null,null,null,null,{"$f":"SUMIF(OFFSET($J12,1,0,ROW(T145)-ROW(T12)-1),\"Serviço\",OFFSET(T12,1,0,ROW(T145)-ROW(T12)-1))","v":551458.10000000009},{"$f":"IF($N12=0,\"DESCRIÇÃO\",\"\")","v":""},0]
[{"$f":"CHOOSE(1+LOG(1+2*(J13=\"Meta\")+4*(J13=\"Nível 2\")+8*(J13=\"Nível 3\")+16*(J13=\"Nível 4\")+32*(J13=\"Serviço\"),2),0,1,2,3,4,\"S\")","v":1},{"$f":"IF(OR(A13=\"S\",A13=0),0,IF(ISERROR(I13),H13,SMALL(H13:I13,1)))","v":73},{"$f":"IF($A13=1,OFFSET(C13,-1,0)+1,OFFSET(C13,-1,0))","v":1},{"$f":"IF($A13=1,0,IF($A13=2,OFFSET(D13,-1,0)+1,OFFSET(D13,-1,0)))","v":0},{"$f":"IF(AND($A13<=2,$A13<>0),0,IF($A13=3,OFFSET(E13,-1,0)+1,OFFSET(E13,-1,0)))","v":0},{"$f":"IF(AND($A13<=3,$A13<>0),0,IF($A13=4,OFFSET(F13,-1,0)+1,OFFSET(F13,-1,0)))","v":0},{"$f":"IF(AND($A13<=4,$A13<>0),0,IF($A13=\"S\",OFFSET(G13,-1,0)+1,OFFSET(G13,-1,0)))","v":0},{"$f":"IF(OR($A13=\"S\",$A13=0),0,MATCH(0,OFFSET($B13,1,$A13,ROW($A$145)-ROW($A13)),0))","v":132},{"$f":"IF(OR($A13=\"S\",$A13=0),0,MATCH(OFFSET($B13,0,$A13)+1,OFFSET($B13,1,$A13,ROW($A$145)-ROW($A13)),0))","v":73},"Meta",{"$f":"IF($A13=0,\"-\",CONCATENATE(C13&\".\",IF(AND($A$5>=2,$A13>=2),D13&\".\",\"\"),IF(AND($A$5>=3,$A13>=3),E13&\".\",\"\"),IF(AND($A$5>=4,$A13>=4),F13&\".\",\"\"),IF($A13=\"S\",G13&\".\",\"\")))","v":"1."},null,null,"LOTE 1 - 1ª ETAPA DA REFORMA","",{"$f":"OFFSET(PLQ!$E$12,ROW($P13)-ROW(P$12),0)","v":0},null,"BDI 1",{"$f":"IF($A13=\"S\",IF($Q$10=\"Preço Unitário (R$)\",PO.CustoUnitario,ROUND(PO.CustoUnitario*(1+$Z13),15-13*$X$6)),0)","v":0},{"$f":"IF($A13=\"S\",VTOTAL1,IF($A13=0,0,ROUND(SomaAgrup,15-13*$X$7)))","v":240414.59},{"$f":"IF($J13=\"\",\"\",IF($N13=\"\",\"DESCRIÇÃO\",IF(AND($J13=\"Serviço\",$O13=\"\"),\"UNIDADE\",IF($T13<=0,\"SEM VALOR\",IF(AND($Y13<>\"\",$Q13>$Y13),\"ACIMA REF.\",\"\")))))","v":""},{"$f":"IF(OR($A13=0,$A13=\"S\",$A13>CFF!$A$9),\"\",MAX(V$12:OFFSET(V13,-1,0))+1)","v":1},{"$f":"IF(AND($J13=\"Serviço\",$M13<>\"\"),IF($L13=\"\",$M13,CONCATENATE($L13,\"-\",$M13)))","v":false},{"$f":"IF(AND(Fonte<>\"\",Código<>\"\"),MATCH(Fonte&\" \"&IF(Fonte=\"sinapi\",SUBSTITUTE(SUBSTITUTE(Código,\"/00\",\"/\"),\"/0\",\"/\"),Código),INDIRECT(\"'[Referência \"&_xlnm.Database&\".xls]Banco'!$a:$a\"),0),\"X\")","v":"X"},{"$f":"IF(Import.Desoneracao=\"sim\",Referencia.Desonerado,Referencia.NaoDesonerado)","v":0},{"$f":"ROUND(IF(ISNUMBER(R13),R13,IF(LEFT(R13,3)=\"BDI\",HLOOKUP(R13,DADOS!$T$37:$X$38,2,FALSE),0)),15-11*$X$5)","v":0.30209999999999998}]
[{"$f":"CHOOSE(1+LOG(1+2*(J14=\"Meta\")+4*(J14=\"Nível 2\")+8*(J14=\"Nível 3\")+16*(J14=\"Nível 4\")+32*(J14=\"Serviço\"),2),0,1,2,3,4,\"S\")","v":2},{"$f":"IF(OR(A14=\"S\",A14=0),0,IF(ISERROR(I14),H14,SMALL(H14:I14,1)))","v":4},{"$f":"IF($A14=1,OFFSET(C14,-1,0)+1,OFFSET(C14,-1,0))","v":1},{"$f":"IF($A14=1,0,IF($A14=2,OFFSET(D14,-1,0)+1,OFFSET(D14,-1,0)))","v":1},{"$f":"IF(AND($A14<=2,$A14<>0),0,IF($A14=3,OFFSET(E14,-1,0)+1,OFFSET(E14,-1,0)))","v":0},{"$f":"IF(AND($A14<=3,$A14<>0),0,IF($A14=4,OFFSET(F14,-1,0)+1,OFFSET(F14,-1,0)))","v":0},{"$f":"IF(AND($A14<=4,$A14<>0),0,IF($A14=\"S\",OFFSET(G14,-1,0)+1,OFFSET(G14,-1,0)))","v":0},72,4,"Nível 2",{"$f":"IF($A14=0,\"-\",CONCATENATE(C14&\".\",IF(AND($A$5>=2,$A14>=2),D14&\".\",\"\"),IF(AND($A$5>=3,$A14>=3),E14&\".\",\"\"),IF(AND($A$5>=4,$A14>=4),F14&\".\",\"\"),IF($A14=\"S\",G14&\".\",\"\")))","v":"1.1."},null,null,"SERVIÇOS INICIAIS",{"$f":"Referencia.Unidade","v":""},{"$f":"OFFSET(PLQ!$E$12,ROW($P14)-ROW(P$12),0)","v":0},null,"BDI 1",{"$f":"IF($A14=\"S\",IF($Q$10=\"Preço Unitário (R$)\",PO.CustoUnitario,ROUND(PO.CustoUnitario*(1+$Z14),15-13*$X$6)),0)","v":0},{"$f":"IF($A14=\"S\",VTOTAL1,IF($A14=0,0,ROUND(SomaAgrup,15-13*$X$7)))","v":8429.14},{"$f":"IF($J14=\"\",\"\",IF($N14=\"\",\"DESCRIÇÃO\",IF(AND($J14=\"Serviço\",$O14=\"\"),\"UNIDADE\",IF($T14<=0,\"SEM VALOR\",IF(AND($Y14<>\"\",$Q14>$Y14),\"ACIMA REF.\",\"\")))))","v":""},{"$f":"IF(OR($A14=0,$A14=\"S\",$A14>CFF!$A$9),\"\",MAX(V$12:OFFSET(V14,-1,0))+1)","v":2},{"$f":"IF(AND($J14=\"Serviço\",$M14<>\"\"),IF($L14=\"\",$M14,CONCATENATE($L14,\"-\",$M14)))","v":false},{"$f":"IF(AND(Fonte<>\"\",Código<>\"\"),MATCH(Fonte&\" \"&IF(Fonte=\"sinapi\",SUBSTITUTE(SUBSTITUTE(Código,\"/00\",\"/\"),\"/0\",\"/\"),Código),INDIRECT(\"'[Referência \"&_xlnm.Database&\".xls]Banco'!$a:$a\"),0),\"X\")","v":"X"},{"$f":"IF(Import.Desoneracao=\"sim\",Referencia.Desonerado,Referencia.NaoDesonerado)","v":0},{"$f":"ROUND(IF(ISNUMBER(R14),R14,IF(LEFT(R14,3)=\"BDI\",HLOOKUP(R14,DADOS!$T$37:$X$38,2,FALSE),0)),15-11*$X$5)","v":0.30209999999999998}]
[{"$f":"CHOOSE(1+LOG(1+2*(J15=\"Meta\")+4*(J15=\"Nível 2\")+8*(J15=\"Nível 3\")+16*(J15=\"Nível 4\")+32*(J15=\"Serviço\"),2),0,1,2,3,4,\"S\")","v":"S"},{"$f":"IF(OR(A15=\"S\",A15=0),0,IF(ISERROR(I15),H15,SMALL(H15:I15,1)))","v":0},{"$f":"IF($A15=1,OFFSET(C15,-1,0)+1,OFFSET(C15,-1,0))","v":1},{"$f":"IF($A15=1,0,IF($A15=2,OFFSET(D15,-1,0)+1,OFFSET(D15,-1,0)))","v":1},{"$f":"IF(AND($A15<=2,$A15<>0),0,IF($A15=3,OFFSET(E15,-1,0)+1,OFFSET(E15,-1,0)))","v":0},{"$f":"IF(AND($A15<=3,$A15<>0),0,IF($A15=4,OFFSET(F15,-1,0)+1,OFFSET(F15,-1,0)))","v":0},{"$f":"IF(AND($A15<=4,$A15<>0),0,IF($A15=\"S\",OFFSET(G15,-1,0)+1,OFFSET(G15,-1,0)))","v":1},0,0,"Serviço",{"$f":"IF($A15=0,\"-\",CONCATENATE(C15&\".\",IF(AND($A$5>=2,$A15>=2),D15&\".\",\"\"),IF(AND($A$5>=3,$A15>=3),E15&\".\",\"\"),IF(AND($A$5>=4,$A15>=4),F15&\".\",\"\"),IF($A15=\"S\",G15&\".\",\"\")))","v":"1.1.0.0.1."},"COMPOSIÇÃO","CONSORTE02","ADMINSTRAÇÃO LOCAL ","MÊS",{"$f":"OFFSET(PLQ!$E$12,ROW($P15)-ROW(P$12),0)","v":2},2596.27,"BDI 1",{"$f":"IF($A15=\"S\",IF($Q$10=\"Preço Unitário (R$)\",PO.CustoUnitario,ROUND(PO.CustoUnitario*(1+$Z15),15-13*$X$6)),0)","v":3380.6},{"$f":"IF($A15=\"S\",VTOTAL1,IF($A15=0,0,ROUND(SomaAgrup,15-13*$X$7)))","v":6761.2},{"$f":"IF($J15=\"\",\"\",IF($N15=\"\",\"DESCRIÇÃO\",IF(AND($J15=\"Serviço\",$O15=\"\"),\"UNIDADE\",IF($T15<=0,\"SEM VALOR\",IF(AND($Y15<>\"\",$Q15>$Y15),\"ACIMA REF.\",\"\")))))","v":""},{"$f":"IF(OR($A15=0,$A15=\"S\",$A15>CFF!$A$9),\"\",MAX(V$12:OFFSET(V15,-1,0))+1)","v":""},{"$f":"IF(AND($J15=\"Serviço\",$M15<>\"\"),IF($L15=\"\",$M15,CONCATENATE($L15,\"-\",$M15)))","v":"COMPOSIÇÃO-CONSORTE02"},{"$f":"IF(AND(Fonte<>\"\",Código<>\"\"),MATCH(Fonte&\" \"&IF(Fonte=\"sinapi\",SUBSTITUTE(SUBSTITUTE(Código,\"/00\",\"/\"),\"/0\",\"/\"),Código),INDIRECT(\"'[Referência \"&_xlnm.Database&\".xls]Banco'!$a:$a\"),0),\"X\")","v":13},{"$f":"IF(Import.Desoneracao=\"sim\",Referencia.Desonerado,Referencia.NaoDesonerado)","v":2596.27},{"$f":"ROUND(IF(ISNUMBER(R15),R15,IF(LEFT(R15,3)=\"BDI\",HLOOKUP(R15,DADOS!$T$37:$X$38,2,FALSE),0)),15-11*$X$5)","v":0.30209999999999998}]
["S",0,1,1,0,0,2,0,0,"Serviço","1.1.0.0.2.","SINAPI","103689","FORNECIMENTO E INSTALAÇÃO DE PLACA DE OBRA COM CHAPA GALVANIZADA E ESTRUTURA DE MADEIRA. AF_03/2022_PS","M2",{"$f":"OFFSET(PLQ!$E$12,ROW($P16)-ROW(P$12),0)","v":2.4},458.73,"BDI 1",597.30999999999995,1433.54,"",{"$f":"IF(OR($A16=0,$A16=\"S\",$A16>CFF!$A$9),\"\",MAX(V$12:OFFSET(V16,-1,0))+1)","v":""},"SINAPI-103689",14889,458.73,{"$f":"ROUND(IF(ISNUMBER(R16),R16,IF(LEFT(R16,3)=\"BDI\",HLOOKUP(R16,DADOS!$T$37:$X$38,2,FALSE),0)),15-11*$X$5)","v":0.30209999999999998}]
[{"$f":"CHOOSE(1+LOG(1+2*(J17=\"Meta\")+4*(J17=\"Nível 2\")+8*(J17=\"Nível 3\")+16*(J17=\"Nível 4\")+32*(J17=\"Serviço\"),2),0,1,2,3,4,\"S\")","v":"S"},{"$f":"IF(OR(A17=\"S\",A17=0),0,IF(ISERROR(I17),H17,SMALL(H17:I17,1)))","v":0},{"$f":"IF($A17=1,OFFSET(C17,-1,0)+1,OFFSET(C17,-1,0))","v":1},{"$f":"IF($A17=1,0,IF($A17=2,OFFSET(D17,-1,0)+1,OFFSET(D17,-1,0)))","v":1},{"$f":"IF(AND($A17<=2,$A17<>0),0,IF($A17=3,OFFSET(E17,-1,0)+1,OFFSET(E17,-1,0)))","v":0},{"$f":"IF(AND($A17<=3,$A17<>0),0,IF($A17=4,OFFSET(F17,-1,0)+1,OFFSET(F17,-1,0)))","v":0},{"$f":"IF(AND($A17<=4,$A17<>0),0,IF($A17=\"S\",OFFSET(G17,-1,0)+1,OFFSET(G17,-1,0)))","v":3},0,0,"Serviço",{"$f":"IF($A17=0,\"-\",CONCATENATE(C17&\".\",IF(AND($A$5>=2,$A17>=2),D17&\".\",\"\"),IF(AND($A$5>=3,$A17>=3),E17&\".\",\"\"),IF(AND($A$5>=4,$A17>=4),F17&\".\",\"\"),IF($A17=\"S\",G17&\".\",\"\")))","v":"1.1.0.0.3."},"SINAPI-I","20193","LOCACAO DE ANDAIME METALICO TIPO FACHADEIRO, PECAS COM APROXIMADAMENTE 1,20 M DE LARGURA E 2,0 M DE ALTURA, INCLUINDO DIAGONAIS EM X, BARRAS DE LIGACAO, SAPATAS E DEMAIS ITENS NECESSARIOS A MONTAGEM (NAO INCLUI INSTALACAO)","M2XMES",{"$f":"OFFSET(PLQ!$E$12,ROW($P17)-ROW(P$12),0)","v":8},22.5,"BDI 1",{"$f":"IF($A17=\"S\",IF($Q$10=\"Preço Unitário (R$)\",PO.CustoUnitario,ROUND(PO.CustoUnitario*(1+$Z17),15-13*$X$6)),0)","v":29.3},{"$f":"IF($A17=\"S\",VTOTAL1,IF($A17=0,0,ROUND(SomaAgrup,15-13*$X$7)))","v":234.4},{"$f":"IF($J17=\"\",\"\",IF($N17=\"\",\"DESCRIÇÃO\",IF(AND($J17=\"Serviço\",$O17=\"\"),\"UNIDADE\",IF($T17<=0,\"SEM VALOR\",IF(AND($Y17<>\"\",$Q17>$Y17),\"ACIMA REF.\",\"\")))))","v":""},{"$f":"IF(OR($A17=0,$A17=\"S\",$A17>CFF!$A$9),\"\",MAX(V$12:OFFSET(V17,-1,0))+1)","v":""},{"$f":"IF(AND($J17=\"Serviço\",$M17<>\"\"),IF($L17=\"\",$M17,CONCATENATE($L17,\"-\",$M17)))","v":"SINAPI-I-20193"},{"$f":"IF(AND(Fonte<>\"\",Código<>\"\"),MATCH(Fonte&\" \"&IF(Fonte=\"sinapi\",SUBSTITUTE(SUBSTITUTE(Código,\"/00\",\"/\"),\"/0\",\"/\"),Código),INDIRECT(\"'[Referência \"&_xlnm.Database&\".xls]Banco'!$a:$a\"),0),\"X\")","v":2667},{"$f":"IF(Import.Desoneracao=\"sim\",Referencia.Desonerado,Referencia.NaoDesonerado)","v":22.5},{"$f":"ROUND(IF(ISNUMBER(R17),R17,IF(LEFT(R17,3)=\"BDI\",HLOOKUP(R17,DADOS!$T$37:$X$38,2,FALSE),0)),15-11*$X$5)","v":0.30209999999999998}]
[2,16,1,2,0,0,0,68,16,"Nível 2","1.2.",null,null,"COBERTURA E PLATATIBANDA",{"$f":"Referencia.Unidade","v":""},{"$f":"OFFSET(PLQ!$E$12,ROW($P18)-ROW(P$12),0)","v":0},null,"BDI 1",0,111989.52,"",{"$f":"IF(OR($A18=0,$A18=\"S\",$A18>CFF!$A$9),\"\",MAX(V$12:OFFSET(V18,-1,0))+1)","v":3},false,"X",0,{"$f":"ROUND(IF(ISNUMBER(R18),R18,IF(LEFT(R18,3)=\"BDI\",HLOOKUP(R18,DADOS!$T$37:$X$38,2,FALSE),0)),15-11*$X$5)","v":0.30209999999999998}]
[{"$f":"CHOOSE(1+LOG(1+2*(J19=\"Meta\")+4*(J19=\"Nível 2\")+8*(J19=\"Nível 3\")+16*(J19=\"Nível 4\")+32*(J19=\"Serviço\"),2),0,1,2,3,4,\"S\")","v":3},{"$f":"IF(OR(A19=\"S\",A19=0),0,IF(ISERROR(I19),H19,SMALL(H19:I19,1)))","v":7},{"$f":"IF($A19=1,OFFSET(C19,-1,0)+1,OFFSET(C19,-1,0))","v":1},{"$f":"IF($A19=1,0,IF($A19=2,OFFSET(D19,-1,0)+1,OFFSET(D19,-1,0)))","v":2},{"$f":"IF(AND($A19<=2,$A19<>0),0,IF($A19=3,OFFSET(E19,-1,0)+1,OFFSET(E19,-1,0)))","v":1},{"$f":"IF(AND($A19<=3,$A19<>0),0,IF($A19=4,OFFSET(F19,-1,0)+1,OFFSET(F19,-1,0)))","v":0},{"$f":"IF(AND($A19<=4,$A19<>0),0,IF($A19=\"S\",OFFSET(G19,-1,0)+1,OFFSET(G19,-1,0)))","v":0},15,7,"Nível 3",{"$f":"IF($A19=0,\"-\",CONCATENATE(C19&\".\",IF(AND($A$5>=2,$A19>=2),D19&\".\",\"\"),IF(AND($A$5>=3,$A19>=3),E19&\".\",\"\"),IF(AND($A$5>=4,$A19>=4),F19&\".\",\"\"),IF($A19=\"S\",G19&\".\",\"\")))","v":"1.2.1."},null,null,"DEMOLIÇÕES E REMOÇÕES",{"$f":"Referencia.Unidade","v":""},{"$f":"OFFSET(PLQ!$E$12,ROW($P19)-ROW(P$12),0)","v":0},null,"BDI 1",{"$f":"IF($A19=\"S\",IF($Q$10=\"Preço Unitário (R$)\",PO.CustoUnitario,ROUND(PO.CustoUnitario*(1+$Z19),15-13*$X$6)),0)","v":0},{"$f":"IF($A19=\"S\",VTOTAL1,IF($A19=0,0,ROUND(SomaAgrup,15-13*$X$7)))","v":6283.6},{"$f":"IF($J19=\"\",\"\",IF($N19=\"\",\"DESCRIÇÃO\",IF(AND($J19=\"Serviço\",$O19=\"\"),\"UNIDADE\",IF($T19<=0,\"SEM VALOR\",IF(AND($Y19<>\"\",$Q19>$Y19),\"ACIMA REF.\",\"\")))))","v":""},{"$f":"IF(OR($A19=0,$A19=\"S\",$A19>CFF!$A$9),\"\",MAX(V$12:OFFSET(V19,-1,0))+1)","v":""},{"$f":"IF(AND($J19=\"Serviço\",$M19<>\"\"),IF($L19=\"\",$M19,CONCATENATE($L19,\"-\",$M19)))","v":false},{"$f":"IF(AND(Fonte<>\"\",Código<>\"\"),MATCH(Fonte&\" \"&IF(Fonte=\"sinapi\",SUBSTITUTE(SUBSTITUTE(Código,\"/00\",\"/\"),\"/0\",\"/\"),Código),INDIRECT(\"'[Referência \"&_xlnm.Database&\".xls]Banco'!$a:$a\"),0),\"X\")","v":"X"},{"$f":"IF(Import.Desoneracao=\"sim\",Referencia.Desonerado,Referencia.NaoDesonerado)","v":0},{"$f":"ROUND(IF(ISNUMBER(R19),R19,IF(LEFT(R19,3)=\"BDI\",HLOOKUP(R19,DADOS!$T$37:$X$38,2,FALSE),0)),15-11*$X$5)","v":0.30209999999999998}]
[{"$f":"CHOOSE(1+LOG(1+2*(J20=\"Meta\")+4*(J20=\"Nível 2\")+8*(J20=\"Nível 3\")+16*(J20=\"Nível 4\")+32*(J20=\"Serviço\"),2),0,1,2,3,4,\"S\")","v":"S"},{"$f":"IF(OR(A20=\"S\",A20=0),0,IF(ISERROR(I20),H20,SMALL(H20:I20,1)))","v":0},{"$f":"IF($A20=1,OFFSET(C20,-1,0)+1,OFFSET(C20,-1,0))","v":1},{"$f":"IF($A20=1,0,IF($A20=2,OFFSET(D20,-1,0)+1,OFFSET(D20,-1,0)))","v":2},{"$f":"IF(AND($A20<=2,$A20<>0),0,IF($A20=3,OFFSET(E20,-1,0)+1,OFFSET(E20,-1,0)))","v":1},{"$f":"IF(AND($A20<=3,$A20<>0),0,IF($A20=4,OFFSET(F20,-1,0)+1,OFFSET(F20,-1,0)))","v":0},{"$f":"IF(AND($A20<=4,$A20<>0),0,IF($A20=\"S\",OFFSET(G20,-1,0)+1,OFFSET(G20,-1,0)))","v":1},0,0,"Serviço",{"$f":"IF($A20=0,\"-\",CONCATENATE(C20&\".\",IF(AND($A$5>=2,$A20>=2),D20&\".\",\"\"),IF(AND($A$5>=3,$A20>=3),E20&\".\",\"\"),IF(AND($A$5>=4,$A20>=4),F20&\".\",\"\"),IF($A20=\"S\",G20&\".\",\"\")))","v":"1.2.1.0.1."},"SINAPI","104803","REMOÇÃO CALHAS E RUFOS, DE FORMA MANUAL, SEM REAPROVEITAMENTO. AF_09/2023","M",{"$f":"OFFSET(PLQ!$E$12,ROW($P20)-ROW(P$12),0)","v":120.4},4.6500000000000004,"BDI 1",{"$f":"IF($A20=\"S\",IF($Q$10=\"Preço Unitário (R$)\",PO.CustoUnitario,ROUND(PO.CustoUnitario*(1+$Z20),15-13*$X$6)),0)","v":6.05},{"$f":"IF($A20=\"S\",VTOTAL1,IF($A20=0,0,ROUND(SomaAgrup,15-13*$X$7)))","v":728.42},{"$f":"IF($J20=\"\",\"\",IF($N20=\"\",\"DESCRIÇÃO\",IF(AND($J20=\"Serviço\",$O20=\"\"),\"UNIDADE\",IF($T20<=0,\"SEM VALOR\",IF(AND($Y20<>\"\",$Q20>$Y20),\"ACIMA REF.\",\"\")))))","v":""},{"$f":"IF(OR($A20=0,$A20=\"S\",$A20>CFF!$A$9),\"\",MAX(V$12:OFFSET(V20,-1,0))+1)","v":""},{"$f":"IF(AND($J20=\"Serviço\",$M20<>\"\"),IF($L20=\"\",$M20,CONCATENATE($L20,\"-\",$M20)))","v":"SINAPI-104803"},7877,4.6500000000000004,{"$f":"ROUND(IF(ISNUMBER(R20),R20,IF(LEFT(R20,3)=\"BDI\",HLOOKUP(R20,DADOS!$T$37:$X$38,2,FALSE),0)),15-11*$X$5)","v":0.30209999999999998}]
[{"$f":"CHOOSE(1+LOG(1+2*(J21=\"Meta\")+4*(J21=\"Nível 2\")+8*(J21=\"Nível 3\")+16*(J21=\"Nível 4\")+32*(J21=\"Serviço\"),2),0,1,2,3,4,\"S\")","v":"S"},{"$f":"IF(OR(A21=\"S\",A21=0),0,IF(ISERROR(I21),H21,SMALL(H21:I21,1)))","v":0},{"$f":"IF($A21=1,OFFSET(C21,-1,0)+1,OFFSET(C21,-1,0))","v":1},{"$f":"IF($A21=1,0,IF($A21=2,OFFSET(D21,-1,0)+1,OFFSET(D21,-1,0)))","v":2},{"$f":"IF(AND($A21<=2,$A21<>0),0,IF($A21=3,OFFSET(E21,-1,0)+1,OFFSET(E21,-1,0)))","v":1},{"$f":"IF(AND($A21<=3,$A21<>0),0,IF($A21=4,OFFSET(F21,-1,0)+1,OFFSET(F21,-1,0)))","v":0},{"$f":"IF(AND($A21<=4,$A21<>0),0,IF($A21=\"S\",OFFSET(G21,-1,0)+1,OFFSET(G21,-1,0)))","v":2},0,0,"Serviço",{"$f":"IF($A21=0,\"-\",CONCATENATE(C21&\".\",IF(AND($A$5>=2,$A21>=2),D21&\".\",\"\"),IF(AND($A$5>=3,$A21>=3),E21&\".\",\"\"),IF(AND($A$5>=4,$A21>=4),F21&\".\",\"\"),IF($A21=\"S\",G21&\".\",\"\")))","v":"1.2.1.0.2."},"SINAPI","93402","GUINDAUTO HIDRÁULICO, CAPACIDADE MÁXIMA DE CARGA 3300 KG, MOMENTO MÁXIMO DE CARGA 5,8 TM, ALCANCE MÁXIMO HORIZONTAL 7,60 M, INCLUSIVE CAMINHÃO TOCO PBT 16.000 KG, POTÊNCIA DE 189 CV - CHP DIURNO. AF_03/2016","CHP",{"$f":"OFFSET(PLQ!$E$12,ROW($P21)-ROW(P$12),0)","v":3},283.72000000000003,"BDI 1",{"$f":"IF($A21=\"S\",IF($Q$10=\"Preço Unitário (R$)\",PO.CustoUnitario,ROUND(PO.CustoUnitario*(1+$Z21),15-13*$X$6)),0)","v":369.43},{"$f":"IF($A21=\"S\",VTOTAL1,IF($A21=0,0,ROUND(SomaAgrup,15-13*$X$7)))","v":1108.29},{"$f":"IF($J21=\"\",\"\",IF($N21=\"\",\"DESCRIÇÃO\",IF(AND($J21=\"Serviço\",$O21=\"\"),\"UNIDADE\",IF($T21<=0,\"SEM VALOR\",IF(AND($Y21<>\"\",$Q21>$Y21),\"ACIMA REF.\",\"\")))))","v":""},{"$f":"IF(OR($A21=0,$A21=\"S\",$A21>CFF!$A$9),\"\",MAX(V$12:OFFSET(V21,-1,0))+1)","v":""},{"$f":"IF(AND($J21=\"Serviço\",$M21<>\"\"),IF($L21=\"\",$M21,CONCATENATE($L21,\"-\",$M21)))","v":"SINAPI-93402"},{"$f":"IF(AND(Fonte<>\"\",Código<>\"\"),MATCH(Fonte&\" \"&IF(Fonte=\"sinapi\",SUBSTITUTE(SUBSTITUTE(Código,\"/00\",\"/\"),\"/0\",\"/\"),Código),INDIRECT(\"'[Referência \"&_xlnm.Database&\".xls]Banco'!$a:$a\"),0),\"X\")","v":7634},{"$f":"IF(Import.Desoneracao=\"sim\",Referencia.Desonerado,Referencia.NaoDesonerado)","v":283.72000000000003},{"$f":"ROUND(IF(ISNUMBER(R21),R21,IF(LEFT(R21,3)=\"BDI\",HLOOKUP(R21,DADOS!$T$37:$X$38,2,FALSE),0)),15-11*$X$5)","v":0.30209999999999998}]
[{"$f":"CHOOSE(1+LOG(1+2*(J22=\"Meta\")+4*(J22=\"Nível 2\")+8*(J22=\"Nível 3\")+16*(J22=\"Nível 4\")+32*(J22=\"Serviço\"),2),0,1,2,3,4,\"S\")","v":"S"},{"$f":"IF(OR(A22=\"S\",A22=0),0,IF(ISERROR(I22),H22,SMALL(H22:I22,1)))","v":0},{"$f":"IF($A22=1,OFFSET(C22,-1,0)+1,OFFSET(C22,-1,0))","v":1},{"$f":"IF($A22=1,0,IF($A22=2,OFFSET(D22,-1,0)+1,OFFSET(D22,-1,0)))","v":2},{"$f":"IF(AND($A22<=2,$A22<>0),0,IF($A22=3,OFFSET(E22,-1,0)+1,OFFSET(E22,-1,0)))","v":1},{"$f":"IF(AND($A22<=3,$A22<>0),0,IF($A22=4,OFFSET(F22,-1,0)+1,OFFSET(F22,-1,0)))","v":0},{"$f":"IF(AND($A22<=4,$A22<>0),0,IF($A22=\"S\",OFFSET(G22,-1,0)+1,OFFSET(G22,-1,0)))","v":3},0,0,"Serviço",{"$f":"IF($A22=0,\"-\",CONCATENATE(C22&\".\",IF(AND($A$5>=2,$A22>=2),D22&\".\",\"\"),IF(AND($A$5>=3,$A22>=3),E22&\".\",\"\"),IF(AND($A$5>=4,$A22>=4),F22&\".\",\"\"),IF($A22=\"S\",G22&\".\",\"\")))","v":"1.2.1.0.3."},"SINAPI","97647","REMOÇÃO DE TELHAS DE FIBROCIMENTO METÁLICA E CERÂMICA, DE FORMA MANUAL, SEM REAPROVEITAMENTO. AF_09/2023","M2",{"$f":"OFFSET(PLQ!$E$12,ROW($P22)-ROW(P$12),0)","v":278.14},3.64,"BDI 1",{"$f":"IF($A22=\"S\",IF($Q$10=\"Preço Unitário (R$)\",PO.CustoUnitario,ROUND(PO.CustoUnitario*(1+$Z22),15-13*$X$6)),0)","v":4.74},{"$f":"IF($A22=\"S\",VTOTAL1,IF($A22=0,0,ROUND(SomaAgrup,15-13*$X$7)))","v":1318.38},{"$f":"IF($J22=\"\",\"\",IF($N22=\"\",\"DESCRIÇÃO\",IF(AND($J22=\"Serviço\",$O22=\"\"),\"UNIDADE\",IF($T22<=0,\"SEM VALOR\",IF(AND($Y22<>\"\",$Q22>$Y22),\"ACIMA REF.\",\"\")))))","v":""},{"$f":"IF(OR($A22=0,$A22=\"S\",$A22>CFF!$A$9),\"\",MAX(V$12:OFFSET(V22,-1,0))+1)","v":""},{"$f":"IF(AND($J22=\"Serviço\",$M22<>\"\"),IF($L22=\"\",$M22,CONCATENATE($L22,\"-\",$M22)))","v":"SINAPI-97647"},7903,3.64,{"$f":"ROUND(IF(ISNUMBER(R22),R22,IF(LEFT(R22,3)=\"BDI\",HLOOKUP(R22,DADOS!$T$37:$X$38,2,FALSE),0)),15-11*$X$5)","v":0.30209999999999998}]
[{"$f":"CHOOSE(1+LOG(1+2*(J23=\"Meta\")+4*(J23=\"Nível 2\")+8*(J23=\"Nível 3\")+16*(J23=\"Nível 4\")+32*(J23=\"Serviço\"),2),0,1,2,3,4,\"S\")","v":"S"},{"$f":"IF(OR(A23=\"S\",A23=0),0,IF(ISERROR(I23),H23,SMALL(H23:I23,1)))","v":0},{"$f":"IF($A23=1,OFFSET(C23,-1,0)+1,OFFSET(C23,-1,0))","v":1},{"$f":"IF($A23=1,0,IF($A23=2,OFFSET(D23,-1,0)+1,OFFSET(D23,-1,0)))","v":2},{"$f":"IF(AND($A23<=2,$A23<>0),0,IF($A23=3,OFFSET(E23,-1,0)+1,OFFSET(E23,-1,0)))","v":1},{"$f":"IF(AND($A23<=3,$A23<>0),0,IF($A23=4,OFFSET(F23,-1,0)+1,OFFSET(F23,-1,0)))","v":0},{"$f":"IF(AND($A23<=4,$A23<>0),0,IF($A23=\"S\",OFFSET(G23,-1,0)+1,OFFSET(G23,-1,0)))","v":4},0,0,"Serviço",{"$f":"IF($A23=0,\"-\",CONCATENATE(C23&\".\",IF(AND($A$5>=2,$A23>=2),D23&\".\",\"\"),IF(AND($A$5>=3,$A23>=3),E23&\".\",\"\"),IF(AND($A$5>=4,$A23>=4),F23&\".\",\"\"),IF($A23=\"S\",G23&\".\",\"\")))","v":"1.2.1.0.4."},"SINAPI","97622","DEMOLIÇÃO DE ALVENARIA DE BLOCO FURADO, DE FORMA MANUAL, SEM REAPROVEITAMENTO. AF_09/2023","M3",{"$f":"OFFSET(PLQ!$E$12,ROW($P23)-ROW(P$12),0)","v":15.3},58.61,"BDI 1",{"$f":"IF($A23=\"S\",IF($Q$10=\"Preço Unitário (R$)\",PO.CustoUnitario,ROUND(PO.CustoUnitario*(1+$Z23),15-13*$X$6)),0)","v":76.319999999999993},{"$f":"IF($A23=\"S\",VTOTAL1,IF($A23=0,0,ROUND(SomaAgrup,15-13*$X$7)))","v":1167.7},{"$f":"IF($J23=\"\",\"\",IF($N23=\"\",\"DESCRIÇÃO\",IF(AND($J23=\"Serviço\",$O23=\"\"),\"UNIDADE\",IF($T23<=0,\"SEM VALOR\",IF(AND($Y23<>\"\",$Q23>$Y23),\"ACIMA REF.\",\"\")))))","v":""},{"$f":"IF(OR($A23=0,$A23=\"S\",$A23>CFF!$A$9),\"\",MAX(V$12:OFFSET(V23,-1,0))+1)","v":""},{"$f":"IF(AND($J23=\"Serviço\",$M23<>\"\"),IF($L23=\"\",$M23,CONCATENATE($L23,\"-\",$M23)))","v":"SINAPI-97622"},7858,58.61,{"$f":"ROUND(IF(ISNUMBER(R23),R23,IF(LEFT(R23,3)=\"BDI\",HLOOKUP(R23,DADOS!$T$37:$X$38,2,FALSE),0)),15-11*$X$5)","v":0.30209999999999998}]
["S",0,1,2,1,0,5,0,0,"Serviço","1.2.1.0.5.","SINAPI","100209","TRANSPORTE HORIZONTAL MANUAL, DE BLOCOS CERÂMICOS FURADOS NA HORIZONTAL DE 9X19X19CM (UNIDADE: BLOCOXKM). AF_07/2019","UNXKM",{"$f":"OFFSET(PLQ!$E$12,ROW($P24)-ROW(P$12),0)","v":84.7},10.1,"BDI 1",13.15,1113.81,"",{"$f":"IF(OR($A24=0,$A24=\"S\",$A24>CFF!$A$9),\"\",MAX(V$12:OFFSET(V24,-1,0))+1)","v":""},"SINAPI-100209",{"$f":"IF(AND(Fonte<>\"\",Código<>\"\"),MATCH(Fonte&\" \"&IF(Fonte=\"sinapi\",SUBSTITUTE(SUBSTITUTE(Código,\"/00\",\"/\"),\"/0\",\"/\"),Código),INDIRECT(\"'[Referência \"&_xlnm.Database&\".xls]Banco'!$a:$a\"),0),\"X\")","v":15244},{"$f":"IF(Import.Desoneracao=\"sim\",Referencia.Desonerado,Referencia.NaoDesonerado)","v":10.1},{"$f":"ROUND(IF(ISNUMBER(R24),R24,IF(LEFT(R24,3)=\"BDI\",HLOOKUP(R24,DADOS!$T$37:$X$38,2,FALSE),0)),15-11*$X$5)","v":0.30209999999999998}]
["S",0,1,2,1,0,6,0,0,"Serviço","1.2.1.0.6.","SINAPI","100233","TRANSPORTE VERTICAL MANUAL, 1 PAVIMENTO, DE BLOCOS CERÂMICOS FURADOS NA HORIZONTAL DE 9X19X19CM (UNIDADE: BLOCO). AF_07/2019","UN",{"$f":"OFFSET(PLQ!$E$12,ROW($P25)-ROW(P$12),0)","v":3388},0.19,"BDI 1",0.25,847,"",{"$f":"IF(OR($A25=0,$A25=\"S\",$A25>CFF!$A$9),\"\",MAX(V$12:OFFSET(V25,-1,0))+1)","v":""},"SINAPI-100233",{"$f":"IF(AND(Fonte<>\"\",Código<>\"\"),MATCH(Fonte&\" \"&IF(Fonte=\"sinapi\",SUBSTITUTE(SUBSTITUTE(Código,\"/00\",\"/\"),\"/0\",\"/\"),Código),INDIRECT(\"'[Referência \"&_xlnm.Database&\".xls]Banco'!$a:$a\"),0),\"X\")","v":15289},{"$f":"IF(Import.Desoneracao=\"sim\",Referencia.Desonerado,Referencia.NaoDesonerado)","v":0.19},{"$f":"ROUND(IF(ISNUMBER(R25),R25,IF(LEFT(R25,3)=\"BDI\",HLOOKUP(R25,DADOS!$T$37:$X$38,2,FALSE),0)),15-11*$X$5)","v":0.30209999999999998}]
[{"$f":"CHOOSE(1+LOG(1+2*(J26=\"Meta\")+4*(J26=\"Nível 2\")+8*(J26=\"Nível 3\")+16*(J26=\"Nível 4\")+32*(J26=\"Serviço\"),2),0,1,2,3,4,\"S\")","v":3},{"$f":"IF(OR(A26=\"S\",A26=0),0,IF(ISERROR(I26),H26,SMALL(H26:I26,1)))","v":8},{"$f":"IF($A26=1,OFFSET(C26,-1,0)+1,OFFSET(C26,-1,0))","v":1},{"$f":"IF($A26=1,0,IF($A26=2,OFFSET(D26,-1,0)+1,OFFSET(D26,-1,0)))","v":2},{"$f":"IF(AND($A26<=2,$A26<>0),0,IF($A26=3,OFFSET(E26,-1,0)+1,OFFSET(E26,-1,0)))","v":2},{"$f":"IF(AND($A26<=3,$A26<>0),0,IF($A26=4,OFFSET(F26,-1,0)+1,OFFSET(F26,-1,0)))","v":0},{"$f":"IF(AND($A26<=4,$A26<>0),0,IF($A26=\"S\",OFFSET(G26,-1,0)+1,OFFSET(G26,-1,0)))","v":0},8,117,"Nível 3",{"$f":"IF($A26=0,\"-\",CONCATENATE(C26&\".\",IF(AND($A$5>=2,$A26>=2),D26&\".\",\"\"),IF(AND($A$5>=3,$A26>=3),E26&\".\",\"\"),IF(AND($A$5>=4,$A26>=4),F26&\".\",\"\"),IF($A26=\"S\",G26&\".\",\"\")))","v":"1.2.2."},null,null,"EXECUÇÃO DA COBERTURA",{"$f":"Referencia.Unidade","v":""},{"$f":"OFFSET(PLQ!$E$12,ROW($P26)-ROW(P$12),0)","v":0},null,"BDI 1",{"$f":"IF($A26=\"S\",IF($Q$10=\"Preço Unitário (R$)\",PO.CustoUnitario,ROUND(PO.CustoUnitario*(1+$Z26),15-13*$X$6)),0)","v":0},{"$f":"IF($A26=\"S\",VTOTAL1,IF($A26=0,0,ROUND(SomaAgrup,15-13*$X$7)))","v":105705.92},{"$f":"IF($J26=\"\",\"\",IF($N26=\"\",\"DESCRIÇÃO\",IF(AND($J26=\"Serviço\",$O26=\"\"),\"UNIDADE\",IF($T26<=0,\"SEM VALOR\",IF(AND($Y26<>\"\",$Q26>$Y26),\"ACIMA REF.\",\"\")))))","v":""},{"$f":"IF(OR($A26=0,$A26=\"S\",$A26>CFF!$A$9),\"\",MAX(V$12:OFFSET(V26,-1,0))+1)","v":""},{"$f":"IF(AND($J26=\"Serviço\",$M26<>\"\"),IF($L26=\"\",$M26,CONCATENATE($L26,\"-\",$M26)))","v":false},{"$f":"IF(AND(Fonte<>\"\",Código<>\"\"),MATCH(Fonte&\" \"&IF(Fonte=\"sinapi\",SUBSTITUTE(SUBSTITUTE(Código,\"/00\",\"/\"),\"/0\",\"/\"),Código),INDIRECT(\"'[Referência \"&_xlnm.Database&\".xls]Banco'!$a:$a\"),0),\"X\")","v":"X"},{"$f":"IF(Import.Desoneracao=\"sim\",Referencia.Desonerado,Referencia.NaoDesonerado)","v":0},{"$f":"ROUND(IF(ISNUMBER(R26),R26,IF(LEFT(R26,3)=\"BDI\",HLOOKUP(R26,DADOS!$T$37:$X$38,2,FALSE),0)),15-11*$X$5)","v":0.30209999999999998}]
["S",0,1,2,2,0,1,0,0,"Serviço","1.2.2.0.1.","COTAÇÃO","RCV03","PROLONGAMENTO DE 0,50M DE TRELIÇA METÁLICA (PERFIL U 75X38 #3,00MM) - FORNECIMENTO E INSTALAÇÃO ","UN ",{"$f":"OFFSET(PLQ!$E$12,ROW($P27)-ROW(P$12),0)","v":18},195,"BDI 1",253.91,4570.38,"",{"$f":"IF(OR($A27=0,$A27=\"S\",$A27>CFF!$A$9),\"\",MAX(V$12:OFFSET(V27,-1,0))+1)","v":""},"COTAÇÃO-RCV03",19,195,{"$f":"ROUND(IF(ISNUMBER(R27),R27,IF(LEFT(R27,3)=\"BDI\",HLOOKUP(R27,DADOS!$T$37:$X$38,2,FALSE),0)),15-11*$X$5)","v":0.30209999999999998}]
[{"$f":"CHOOSE(1+LOG(1+2*(J28=\"Meta\")+4*(J28=\"Nível 2\")+8*(J28=\"Nível 3\")+16*(J28=\"Nível 4\")+32*(J28=\"Serviço\"),2),0,1,2,3,4,\"S\")","v":"S"},{"$f":"IF(OR(A28=\"S\",A28=0),0,IF(ISERROR(I28),H28,SMALL(H28:I28,1)))","v":0},{"$f":"IF($A28=1,OFFSET(C28,-1,0)+1,OFFSET(C28,-1,0))","v":1},{"$f":"IF($A28=1,0,IF($A28=2,OFFSET(D28,-1,0)+1,OFFSET(D28,-1,0)))","v":2},{"$f":"IF(AND($A28<=2,$A28<>0),0,IF($A28=3,OFFSET(E28,-1,0)+1,OFFSET(E28,-1,0)))","v":2},{"$f":"IF(AND($A28<=3,$A28<>0),0,IF($A28=4,OFFSET(F28,-1,0)+1,OFFSET(F28,-1,0)))","v":0},{"$f":"IF(AND($A28<=4,$A28<>0),0,IF($A28=\"S\",OFFSET(G28,-1,0)+1,OFFSET(G28,-1,0)))","v":2},0,0,"Serviço",{"$f":"IF($A28=0,\"-\",CONCATENATE(C28&\".\",IF(AND($A$5>=2,$A28>=2),D28&\".\",\"\"),IF(AND($A$5>=3,$A28>=3),E28&\".\",\"\"),IF(AND($A$5>=4,$A28>=4),F28&\".\",\"\"),IF($A28=\"S\",G28&\".\",\"\")))","v":"1.2.2.0.2."},"SINAPI","92580","TRAMA DE AÇO COMPOSTA POR TERÇAS PARA TELHADOS DE ATÉ 2 ÁGUAS PARA TELHA ONDULADA DE FIBROCIMENTO, METÁLICA, PLÁSTICA OU TERMOACÚSTICA, INCLUSO TRANSPORTE VERTICAL. AF_07/2019","M2",{"$f":"OFFSET(PLQ!$E$12,ROW($P28)-ROW(P$12),0)","v":67.459999999999994},56.43,"BDI 1",{"$f":"IF($A28=\"S\",IF($Q$10=\"Preço Unitário (R$)\",PO.CustoUnitario,ROUND(PO.CustoUnitario*(1+$Z28),15-13*$X$6)),0)","v":73.48},{"$f":"IF($A28=\"S\",VTOTAL1,IF($A28=0,0,ROUND(SomaAgrup,15-13*$X$7)))","v":4956.96},{"$f":"IF($J28=\"\",\"\",IF($N28=\"\",\"DESCRIÇÃO\",IF(AND($J28=\"Serviço\",$O28=\"\"),\"UNIDADE\",IF($T28<=0,\"SEM VALOR\",IF(AND($Y28<>\"\",$Q28>$Y28),\"ACIMA REF.\",\"\")))))","v":""},{"$f":"IF(OR($A28=0,$A28=\"S\",$A28>CFF!$A$9),\"\",MAX(V$12:OFFSET(V28,-1,0))+1)","v":""},{"$f":"IF(AND($J28=\"Serviço\",$M28<>\"\"),IF($L28=\"\",$M28,CONCATENATE($L28,\"-\",$M28)))","v":"SINAPI-92580"},{"$f":"IF(AND(Fonte<>\"\",Código<>\"\"),MATCH(Fonte&\" \"&IF(Fonte=\"sinapi\",SUBSTITUTE(SUBSTITUTE(Código,\"/00\",\"/\"),\"/0\",\"/\"),Código),INDIRECT(\"'[Referência \"&_xlnm.Database&\".xls]Banco'!$a:$a\"),0),\"X\")","v":9732},{"$f":"IF(Import.Desoneracao=\"sim\",Referencia.Desonerado,Referencia.NaoDesonerado)","v":56.43},{"$f":"ROUND(IF(ISNUMBER(R28),R28,IF(LEFT(R28,3)=\"BDI\",HLOOKUP(R28,DADOS!$T$37:$X$38,2,FALSE),0)),15-11*$X$5)","v":0.30209999999999998}]
[{"$f":"CHOOSE(1+LOG(1+2*(J29=\"Meta\")+4*(J29=\"Nível 2\")+8*(J29=\"Nível 3\")+16*(J29=\"Nível 4\")+32*(J29=\"Serviço\"),2),0,1,2,3,4,\"S\")","v":"S"},{"$f":"IF(OR(A29=\"S\",A29=0),0,IF(ISERROR(I29),H29,SMALL(H29:I29,1)))","v":0},{"$f":"IF($A29=1,OFFSET(C29,-1,0)+1,OFFSET(C29,-1,0))","v":1},{"$f":"IF($A29=1,0,IF($A29=2,OFFSET(D29,-1,0)+1,OFFSET(D29,-1,0)))","v":2},{"$f":"IF(AND($A29<=2,$A29<>0),0,IF($A29=3,OFFSET(E29,-1,0)+1,OFFSET(E29,-1,0)))","v":2},{"$f":"IF(AND($A29<=3,$A29<>0),0,IF($A29=4,OFFSET(F29,-1,0)+1,OFFSET(F29,-1,0)))","v":0},{"$f":"IF(AND($A29<=4,$A29<>0),0,IF($A29=\"S\",OFFSET(G29,-1,0)+1,OFFSET(G29,-1,0)))","v":3},0,0,"Serviço",{"$f":"IF($A29=0,\"-\",CONCATENATE(C29&\".\",IF(AND($A$5>=2,$A29>=2),D29&\".\",\"\"),IF(AND($A$5>=3,$A29>=3),E29&\".\",\"\"),IF(AND($A$5>=4,$A29>=4),F29&\".\",\"\"),IF($A29=\"S\",G29&\".\",\"\")))","v":"1.2.2.0.3."},"COMPOSIÇÃO","SINAPI94216ADAPTADA","TELHAMENTO COM TELHA TERMOISOLANTE EM AÇO GALVALUME 0,50MM, FACE SUPERIOR TRAPEZOIDAL E FACE INFERIOR PLANA, NÚCLEO EM POLIISOCIANUTO (PIR) 50MM, COM ATÉ 2 ÁGUAS, INCLUSO IÇAMENTO. AF_07/2019","M2",{"$f":"OFFSET(PLQ!$E$12,ROW($P29)-ROW(P$12),0)","v":326.10000000000002},187.25,"BDI 1",{"$f":"IF($A29=\"S\",IF($Q$10=\"Preço Unitário (R$)\",PO.CustoUnitario,ROUND(PO.CustoUnitario*(1+$Z29),15-13*$X$6)),0)","v":243.82},{"$f":"IF($A29=\"S\",VTOTAL1,IF($A29=0,0,ROUND(SomaAgrup,15-13*$X$7)))","v":79509.7},{"$f":"IF($J29=\"\",\"\",IF($N29=\"\",\"DESCRIÇÃO\",IF(AND($J29=\"Serviço\",$O29=\"\"),\"UNIDADE\",IF($T29<=0,\"SEM VALOR\",IF(AND($Y29<>\"\",$Q29>$Y29),\"ACIMA REF.\",\"\")))))","v":""},{"$f":"IF(OR($A29=0,$A29=\"S\",$A29>CFF!$A$9),\"\",MAX(V$12:OFFSET(V29,-1,0))+1)","v":""},{"$f":"IF(AND($J29=\"Serviço\",$M29<>\"\"),IF($L29=\"\",$M29,CONCATENATE($L29,\"-\",$M29)))","v":"COMPOSIÇÃO-SINAPI94216ADAPTADA"},7,187.25000000000003,{"$f":"ROUND(IF(ISNUMBER(R29),R29,IF(LEFT(R29,3)=\"BDI\",HLOOKUP(R29,DADOS!$T$37:$X$38,2,FALSE),0)),15-11*$X$5)","v":0.30209999999999998}]
["S",0,1,2,2,0,4,0,0,"Serviço","1.2.2.0.4.","SINAPI","100326","CUMEEIRA NORMAL PARA TELHA TRAPEZOIDAL DE AÇO, E = 0,5 MM, INCLUSO ACESSÓRIOS DE FIXAÇÃO E IÇAMENTO. AF_07/2019","M",{"$f":"OFFSET(PLQ!$E$12,ROW($P30)-ROW(P$12),0)","v":24.42},93.19,"BDI 1",121.34,2963.12,"ACIMA REF.",{"$f":"IF(OR($A30=0,$A30=\"S\",$A30>CFF!$A$9),\"\",MAX(V$12:OFFSET(V30,-1,0))+1)","v":""},"SINAPI-100326",15050,0,{"$f":"ROUND(IF(ISNUMBER(R30),R30,IF(LEFT(R30,3)=\"BDI\",HLOOKUP(R30,DADOS!$T$37:$X$38,2,FALSE),0)),15-11*$X$5)","v":0.30209999999999998}]
["S",0,1,2,2,0,5,0,0,"Serviço","1.2.2.0.5.","SINAPI","94229","CALHA EM CHAPA DE AÇO GALVANIZADO NÚMERO 24, DESENVOLVIMENTO DE 100 CM, INCLUSO TRANSPORTE VERTICAL. AF_07/2019","M",{"$f":"OFFSET(PLQ!$E$12,ROW($P31)-ROW(P$12),0)","v":48.84},193.68,"BDI 1",252.19,12316.96,"",{"$f":"IF(OR($A31=0,$A31=\"S\",$A31>CFF!$A$9),\"\",MAX(V$12:OFFSET(V31,-1,0))+1)","v":""},"SINAPI-94229",15045,193.68,{"$f":"ROUND(IF(ISNUMBER(R31),R31,IF(LEFT(R31,3)=\"BDI\",HLOOKUP(R31,DADOS!$T$37:$X$38,2,FALSE),0)),15-11*$X$5)","v":0.30209999999999998}]
["S",0,1,2,2,0,6,0,0,"Serviço","1.2.2.0.6.","SINAPI","89585","JOELHO 45 GRAUS, PVC, SERIE R, ÁGUA PLUVIAL, DN 100 MM, JUNTA ELÁSTICA, FORNECIDO E INSTALADO EM CONDUTORES VERTICAIS DE ÁGUAS PLUVIAIS. AF_06/2022","UN",{"$f":"OFFSET(PLQ!$E$12,ROW($P32)-ROW(P$12),0)","v":16},48.41,"BDI 1",63.03,1008.48,"",{"$f":"IF(OR($A32=0,$A32=\"S\",$A32>CFF!$A$9),\"\",MAX(V$12:OFFSET(V32,-1,0))+1)","v":""},"SINAPI-89585",11842,48.41,{"$f":"ROUND(IF(ISNUMBER(R32),R32,IF(LEFT(R32,3)=\"BDI\",HLOOKUP(R32,DADOS!$T$37:$X$38,2,FALSE),0)),15-11*$X$5)","v":0.30209999999999998}]
["S",0,1,2,2,0,7,0,0,"Serviço","1.2.2.0.7.","SINAPI","89669","LUVA SIMPLES, PVC, SERIE R, ÁGUA PLUVIAL, DN 100 MM, JUNTA ELÁSTICA, FORNECIDO E INSTALADO EM CONDUTORES VERTICAIS DE ÁGUAS PLUVIAIS. AF_06/2022","UN",{"$f":"OFFSET(PLQ!$E$12,ROW($P33)-ROW(P$12),0)","v":8},36.51,"BDI 1",47.54,380.32,"",{"$f":"IF(OR($A33=0,$A33=\"S\",$A33>CFF!$A$9),\"\",MAX(V$12:OFFSET(V33,-1,0))+1)","v":""},"SINAPI-89669",11877,36.51,{"$f":"ROUND(IF(ISNUMBER(R33),R33,IF(LEFT(R33,3)=\"BDI\",HLOOKUP(R33,DADOS!$T$37:$X$38,2,FALSE),0)),15-11*$X$5)","v":0.30209999999999998}]
[{"$f":"CHOOSE(1+LOG(1+2*(J34=\"Meta\")+4*(J34=\"Nível 2\")+8*(J34=\"Nível 3\")+16*(J34=\"Nível 4\")+32*(J34=\"Serviço\"),2),0,1,2,3,4,\"S\")","v":2},{"$f":"IF(OR(A34=\"S\",A34=0),0,IF(ISERROR(I34),H34,SMALL(H34:I34,1)))","v":15},{"$f":"IF($A34=1,OFFSET(C34,-1,0)+1,OFFSET(C34,-1,0))","v":1},{"$f":"IF($A34=1,0,IF($A34=2,OFFSET(D34,-1,0)+1,OFFSET(D34,-1,0)))","v":3},{"$f":"IF(AND($A34<=2,$A34<>0),0,IF($A34=3,OFFSET(E34,-1,0)+1,OFFSET(E34,-1,0)))","v":0},{"$f":"IF(AND($A34<=3,$A34<>0),0,IF($A34=4,OFFSET(F34,-1,0)+1,OFFSET(F34,-1,0)))","v":0},{"$f":"IF(AND($A34<=4,$A34<>0),0,IF($A34=\"S\",OFFSET(G34,-1,0)+1,OFFSET(G34,-1,0)))","v":0},52,15,"Nível 2",{"$f":"IF($A34=0,\"-\",CONCATENATE(C34&\".\",IF(AND($A$5>=2,$A34>=2),D34&\".\",\"\"),IF(AND($A$5>=3,$A34>=3),E34&\".\",\"\"),IF(AND($A$5>=4,$A34>=4),F34&\".\",\"\"),IF($A34=\"S\",G34&\".\",\"\")))","v":"1.3."},null,null,"REMOÇÃO DOS REVESTIMENTOS",{"$f":"Referencia.Unidade","v":""},{"$f":"OFFSET(PLQ!$E$12,ROW($P34)-ROW(P$12),0)","v":0},null,"BDI 1",{"$f":"IF($A34=\"S\",IF($Q$10=\"Preço Unitário (R$)\",PO.CustoUnitario,ROUND(PO.CustoUnitario*(1+$Z34),15-13*$X$6)),0)","v":0},{"$f":"IF($A34=\"S\",VTOTAL1,IF($A34=0,0,ROUND(SomaAgrup,15-13*$X$7)))","v":5977.33},{"$f":"IF($J34=\"\",\"\",IF($N34=\"\",\"DESCRIÇÃO\",IF(AND($J34=\"Serviço\",$O34=\"\"),\"UNIDADE\",IF($T34<=0,\"SEM VALOR\",IF(AND($Y34<>\"\",$Q34>$Y34),\"ACIMA REF.\",\"\")))))","v":""},{"$f":"IF(OR($A34=0,$A34=\"S\",$A34>CFF!$A$9),\"\",MAX(V$12:OFFSET(V34,-1,0))+1)","v":4},{"$f":"IF(AND($J34=\"Serviço\",$M34<>\"\"),IF($L34=\"\",$M34,CONCATENATE($L34,\"-\",$M34)))","v":false},{"$f":"IF(AND(Fonte<>\"\",Código<>\"\"),MATCH(Fonte&\" \"&IF(Fonte=\"sinapi\",SUBSTITUTE(SUBSTITUTE(Código,\"/00\",\"/\"),\"/0\",\"/\"),Código),INDIRECT(\"'[Referência \"&_xlnm.Database&\".xls]Banco'!$a:$a\"),0),\"X\")","v":"X"},{"$f":"IF(Import.Desoneracao=\"sim\",Referencia.Desonerado,Referencia.NaoDesonerado)","v":0},{"$f":"ROUND(IF(ISNUMBER(R34),R34,IF(LEFT(R34,3)=\"BDI\",HLOOKUP(R34,DADOS!$T$37:$X$38,2,FALSE),0)),15-11*$X$5)","v":0.30209999999999998}]
[3,9,1,3,1,0,0,14,9,"Nível 3","1.3.1.",null,null,"PAREDE",{"$f":"Referencia.Unidade","v":""},{"$f":"OFFSET(PLQ!$E$12,ROW($P35)-ROW(P$12),0)","v":0},null,"BDI 1",0,4282.43,"",{"$f":"IF(OR($A35=0,$A35=\"S\",$A35>CFF!$A$9),\"\",MAX(V$12:OFFSET(V35,-1,0))+1)","v":""},false,"X",{"$f":"IF(Import.Desoneracao=\"sim\",Referencia.Desonerado,Referencia.NaoDesonerado)","v":0},{"$f":"ROUND(IF(ISNUMBER(R35),R35,IF(LEFT(R35,3)=\"BDI\",HLOOKUP(R35,DADOS!$T$37:$X$38,2,FALSE),0)),15-11*$X$5)","v":0.30209999999999998}]
[4,5,1,3,1,1,0,8,5,"Nível 4","1.3.1.1.",null,null,"INTERNO",{"$f":"Referencia.Unidade","v":""},{"$f":"OFFSET(PLQ!$E$12,ROW($P36)-ROW(P$12),0)","v":0},null,"BDI 1",0,2162.65,"",{"$f":"IF(OR($A36=0,$A36=\"S\",$A36>CFF!$A$9),\"\",MAX(V$12:OFFSET(V36,-1,0))+1)","v":""},false,"X",{"$f":"IF(Import.Desoneracao=\"sim\",Referencia.Desonerado,Referencia.NaoDesonerado)","v":0},{"$f":"ROUND(IF(ISNUMBER(R36),R36,IF(LEFT(R36,3)=\"BDI\",HLOOKUP(R36,DADOS!$T$37:$X$38,2,FALSE),0)),15-11*$X$5)","v":0.30209999999999998}]
["S",0,1,3,1,1,1,0,0,"Serviço","1.3.1.1.1.","SINAPI","97631","DEMOLIÇÃO DE ARGAMASSAS, DE FORMA MANUAL, SEM REAPROVEITAMENTO. AF_09/2023","M2",{"$f":"OFFSET(PLQ!$E$12,ROW($P37)-ROW(P$12),0)","v":105.68},11.74,"BDI 1",15.29,1615.85,"",{"$f":"IF(OR($A37=0,$A37=\"S\",$A37>CFF!$A$9),\"\",MAX(V$12:OFFSET(V37,-1,0))+1)","v":""},"SINAPI-97631",7863,11.74,{"$f":"ROUND(IF(ISNUMBER(R37),R37,IF(LEFT(R37,3)=\"BDI\",HLOOKUP(R37,DADOS!$T$37:$X$38,2,FALSE),0)),15-11*$X$5)","v":0.30209999999999998}]
["S",0,1,3,1,1,2,0,0,"Serviço","1.3.1.1.2.","SINAPI","97634","DEMOLIÇÃO DE REVESTIMENTO CERÂMICO, DE FORMA MECANIZADA COM MARTELETE, SEM REAPROVEITAMENTO. AF_09/2023","M2",{"$f":"OFFSET(PLQ!$E$12,ROW($P38)-ROW(P$12),0)","v":22.33},8.2100000000000009,"BDI 1",10.69,238.71,"",{"$f":"IF(OR($A38=0,$A38=\"S\",$A38>CFF!$A$9),\"\",MAX(V$12:OFFSET(V38,-1,0))+1)","v":""},{"$f":"IF(AND($J38=\"Serviço\",#REF!<>\"\"),IF(#REF!=\"\",#REF!,CONCATENATE(#REF!,\"-\",#REF!)))","v":{"$error":"#REF!"}},{"$f":"IF(AND(Fonte<>\"\",Código<>\"\"),MATCH(Fonte&\" \"&IF(Fonte=\"sinapi\",SUBSTITUTE(SUBSTITUTE(Código,\"/00\",\"/\"),\"/0\",\"/\"),Código),INDIRECT(\"'[Referência \"&_xlnm.Database&\".xls]Banco'!$a:$a\"),0),\"X\")","v":7873},{"$f":"IF(Import.Desoneracao=\"sim\",Referencia.Desonerado,Referencia.NaoDesonerado)","v":8.2100000000000009},{"$f":"ROUND(IF(ISNUMBER(R38),R38,IF(LEFT(R38,3)=\"BDI\",HLOOKUP(R38,DADOS!$T$37:$X$38,2,FALSE),0)),15-11*$X$5)","v":0.30209999999999998}]
[{"$f":"CHOOSE(1+LOG(1+2*(J39=\"Meta\")+4*(J39=\"Nível 2\")+8*(J39=\"Nível 3\")+16*(J39=\"Nível 4\")+32*(J39=\"Serviço\"),2),0,1,2,3,4,\"S\")","v":"S"},{"$f":"IF(OR(A39=\"S\",A39=0),0,IF(ISERROR(I39),H39,SMALL(H39:I39,1)))","v":0},{"$f":"IF($A39=1,OFFSET(C39,-1,0)+1,OFFSET(C39,-1,0))","v":1},{"$f":"IF($A39=1,0,IF($A39=2,OFFSET(D39,-1,0)+1,OFFSET(D39,-1,0)))","v":3},{"$f":"IF(AND($A39<=2,$A39<>0),0,IF($A39=3,OFFSET(E39,-1,0)+1,OFFSET(E39,-1,0)))","v":1},{"$f":"IF(AND($A39<=3,$A39<>0),0,IF($A39=4,OFFSET(F39,-1,0)+1,OFFSET(F39,-1,0)))","v":1},{"$f":"IF(AND($A39<=4,$A39<>0),0,IF($A39=\"S\",OFFSET(G39,-1,0)+1,OFFSET(G39,-1,0)))","v":3},0,0,"Serviço",{"$f":"IF($A39=0,\"-\",CONCATENATE(C39&\".\",IF(AND($A$5>=2,$A39>=2),D39&\".\",\"\"),IF(AND($A$5>=3,$A39>=3),E39&\".\",\"\"),IF(AND($A$5>=4,$A39>=4),F39&\".\",\"\"),IF($A39=\"S\",G39&\".\",\"\")))","v":"1.3.1.1.3."},"COMPOSIÇÃO","CONSORTE04","REMOÇÃO DE PAINEL EM GRANITO COM REAPROVEITAMENTO","M2",{"$f":"OFFSET(PLQ!$E$12,ROW($P39)-ROW(P$12),0)","v":9},25,"BDI 1",{"$f":"IF($A39=\"S\",IF($Q$10=\"Preço Unitário (R$)\",PO.CustoUnitario,ROUND(PO.CustoUnitario*(1+$Z39),15-13*$X$6)),0)","v":32.549999999999997},{"$f":"IF($A39=\"S\",VTOTAL1,IF($A39=0,0,ROUND(SomaAgrup,15-13*$X$7)))","v":292.95},{"$f":"IF($J39=\"\",\"\",IF($N39=\"\",\"DESCRIÇÃO\",IF(AND($J39=\"Serviço\",$O39=\"\"),\"UNIDADE\",IF($T39<=0,\"SEM VALOR\",IF(AND($Y39<>\"\",$Q39>$Y39),\"ACIMA REF.\",\"\")))))","v":"ACIMA REF."},{"$f":"IF(OR($A39=0,$A39=\"S\",$A39>CFF!$A$9),\"\",MAX(V$12:OFFSET(V39,-1,0))+1)","v":""},{"$f":"IF(AND($J39=\"Serviço\",$M39<>\"\"),IF($L39=\"\",$M39,CONCATENATE($L39,\"-\",$M39)))","v":"COMPOSIÇÃO-CONSORTE04"},{"$f":"IF(AND(Fonte<>\"\",Código<>\"\"),MATCH(Fonte&\" \"&IF(Fonte=\"sinapi\",SUBSTITUTE(SUBSTITUTE(Código,\"/00\",\"/\"),\"/0\",\"/\"),Código),INDIRECT(\"'[Referência \"&_xlnm.Database&\".xls]Banco'!$a:$a\"),0),\"X\")","v":{"$error":"#N/A"}},{"$f":"IF(Import.Desoneracao=\"sim\",Referencia.Desonerado,Referencia.NaoDesonerado)","v":0},{"$f":"ROUND(IF(ISNUMBER(R39),R39,IF(LEFT(R39,3)=\"BDI\",HLOOKUP(R39,DADOS!$T$37:$X$38,2,FALSE),0)),15-11*$X$5)","v":0.30209999999999998}]
["S",0,1,3,1,1,4,0,0,"Serviço","1.3.1.1.4.","COMPOSIÇÃO","SINAPI100209ADAPTADA","TRANSPORTE MANUAL DE REVESTIMENTOS ARGAMASSADOS REMOVIDOS COM CARRINHO DE MÃO 45L - INCLUSO CARGA E DESCARGA","M3XKM",{"$f":"OFFSET(PLQ!$E$12,ROW($P40)-ROW(P$12),0)","v":0.08},145.34,"BDI 1",{"$f":"IF($A40=\"S\",IF($Q$10=\"Preço Unitário (R$)\",PO.CustoUnitario,ROUND(PO.CustoUnitario*(1+$Z40),15-13*$X$6)),0)","v":189.25},{"$f":"IF($A40=\"S\",VTOTAL1,IF($A40=0,0,ROUND(SomaAgrup,15-13*$X$7)))","v":15.14},"",{"$f":"IF(OR($A40=0,$A40=\"S\",$A40>CFF!$A$9),\"\",MAX(V$12:OFFSET(V40,-1,0))+1)","v":""},{"$f":"IF(AND($J40=\"Serviço\",$M40<>\"\"),IF($L40=\"\",$M40,CONCATENATE($L40,\"-\",$M40)))","v":"COMPOSIÇÃO-SINAPI100209ADAPTADA"},{"$f":"IF(AND(Fonte<>\"\",Código<>\"\"),MATCH(Fonte&\" \"&IF(Fonte=\"sinapi\",SUBSTITUTE(SUBSTITUTE(Código,\"/00\",\"/\"),\"/0\",\"/\"),Código),INDIRECT(\"'[Referência \"&_xlnm.Database&\".xls]Banco'!$a:$a\"),0),\"X\")","v":12},{"$f":"IF(Import.Desoneracao=\"sim\",Referencia.Desonerado,Referencia.NaoDesonerado)","v":145.34},{"$f":"ROUND(IF(ISNUMBER(R40),R40,IF(LEFT(R40,3)=\"BDI\",HLOOKUP(R40,DADOS!$T$37:$X$38,2,FALSE),0)),15-11*$X$5)","v":0.30209999999999998}]
[{"$f":"CHOOSE(1+LOG(1+2*(J41=\"Meta\")+4*(J41=\"Nível 2\")+8*(J41=\"Nível 3\")+16*(J41=\"Nível 4\")+32*(J41=\"Serviço\"),2),0,1,2,3,4,\"S\")","v":4},{"$f":"IF(OR(A41=\"S\",A41=0),0,IF(ISERROR(I41),H41,SMALL(H41:I41,1)))","v":3},{"$f":"IF($A41=1,OFFSET(C41,-1,0)+1,OFFSET(C41,-1,0))","v":1},{"$f":"IF($A41=1,0,IF($A41=2,OFFSET(D41,-1,0)+1,OFFSET(D41,-1,0)))","v":3},{"$f":"IF(AND($A41<=2,$A41<>0),0,IF($A41=3,OFFSET(E41,-1,0)+1,OFFSET(E41,-1,0)))","v":1},{"$f":"IF(AND($A41<=3,$A41<>0),0,IF($A41=4,OFFSET(F41,-1,0)+1,OFFSET(F41,-1,0)))","v":2},{"$f":"IF(AND($A41<=4,$A41<>0),0,IF($A41=\"S\",OFFSET(G41,-1,0)+1,OFFSET(G41,-1,0)))","v":0},3,{"$error":"#N/A"},"Nível 4",{"$f":"IF($A41=0,\"-\",CONCATENATE(C41&\".\",IF(AND($A$5>=2,$A41>=2),D41&\".\",\"\"),IF(AND($A$5>=3,$A41>=3),E41&\".\",\"\"),IF(AND($A$5>=4,$A41>=4),F41&\".\",\"\"),IF($A41=\"S\",G41&\".\",\"\")))","v":"1.3.1.2."},null,null,"EXTERNO",{"$f":"Referencia.Unidade","v":""},{"$f":"OFFSET(PLQ!$E$12,ROW($P41)-ROW(P$12),0)","v":0},null,"BDI 1",0,2119.7800000000002,{"$f":"IF($J41=\"\",\"\",IF($N41=\"\",\"DESCRIÇÃO\",IF(AND($J41=\"Serviço\",$O41=\"\"),\"UNIDADE\",IF($T41<=0,\"SEM VALOR\",IF(AND($Y41<>\"\",$Q41>$Y41),\"ACIMA REF.\",\"\")))))","v":""},{"$f":"IF(OR($A41=0,$A41=\"S\",$A41>CFF!$A$9),\"\",MAX(V$12:OFFSET(V41,-1,0))+1)","v":""},{"$f":"IF(AND($J41=\"Serviço\",$M41<>\"\"),IF($L41=\"\",$M41,CONCATENATE($L41,\"-\",$M41)))","v":false},"X",{"$f":"IF(Import.Desoneracao=\"sim\",Referencia.Desonerado,Referencia.NaoDesonerado)","v":0},{"$f":"ROUND(IF(ISNUMBER(R41),R41,IF(LEFT(R41,3)=\"BDI\",HLOOKUP(R41,DADOS!$T$37:$X$38,2,FALSE),0)),15-11*$X$5)","v":0.30209999999999998}]
["S",0,1,3,1,2,1,0,0,"Serviço","1.3.1.2.1.","SINAPI","97631","DEMOLIÇÃO DE ARGAMASSAS, DE FORMA MANUAL, SEM REAPROVEITAMENTO. AF_09/2023","M2",{"$f":"OFFSET(PLQ!$E$12,ROW($P42)-ROW(P$12),0)","v":137.4},11.74,"BDI 1",15.29,2100.85,"",{"$f":"IF(OR($A42=0,$A42=\"S\",$A42>CFF!$A$9),\"\",MAX(V$12:OFFSET(V42,-1,0))+1)","v":""},"SINAPI-97631",7863,{"$f":"IF(Import.Desoneracao=\"sim\",Referencia.Desonerado,Referencia.NaoDesonerado)","v":11.74},{"$f":"ROUND(IF(ISNUMBER(R42),R42,IF(LEFT(R42,3)=\"BDI\",HLOOKUP(R42,DADOS!$T$37:$X$38,2,FALSE),0)),15-11*$X$5)","v":0.30209999999999998}]
[{"$f":"CHOOSE(1+LOG(1+2*(J43=\"Meta\")+4*(J43=\"Nível 2\")+8*(J43=\"Nível 3\")+16*(J43=\"Nível 4\")+32*(J43=\"Serviço\"),2),0,1,2,3,4,\"S\")","v":"S"},{"$f":"IF(OR(A43=\"S\",A43=0),0,IF(ISERROR(I43),H43,SMALL(H43:I43,1)))","v":0},{"$f":"IF($A43=1,OFFSET(C43,-1,0)+1,OFFSET(C43,-1,0))","v":1},{"$f":"IF($A43=1,0,IF($A43=2,OFFSET(D43,-1,0)+1,OFFSET(D43,-1,0)))","v":3},{"$f":"IF(AND($A43<=2,$A43<>0),0,IF($A43=3,OFFSET(E43,-1,0)+1,OFFSET(E43,-1,0)))","v":1},{"$f":"IF(AND($A43<=3,$A43<>0),0,IF($A43=4,OFFSET(F43,-1,0)+1,OFFSET(F43,-1,0)))","v":2},{"$f":"IF(AND($A43<=4,$A43<>0),0,IF($A43=\"S\",OFFSET(G43,-1,0)+1,OFFSET(G43,-1,0)))","v":2},0,0,"Serviço",{"$f":"IF($A43=0,\"-\",CONCATENATE(C43&\".\",IF(AND($A$5>=2,$A43>=2),D43&\".\",\"\"),IF(AND($A$5>=3,$A43>=3),E43&\".\",\"\"),IF(AND($A$5>=4,$A43>=4),F43&\".\",\"\"),IF($A43=\"S\",G43&\".\",\"\")))","v":"1.3.1.2.2."},"COMPOSIÇÃO","SINAPI100209ADAPTADA","TRANSPORTE MANUAL DE REVESTIMENTOS ARGAMASSADOS REMOVIDOS COM CARRINHO DE MÃO 45L - INCLUSO CARGA E DESCARGA","M3XKM",{"$f":"OFFSET(PLQ!$E$12,ROW($P43)-ROW(P$12),0)","v":0.1},145.34,"BDI 1",{"$f":"IF($A43=\"S\",IF($Q$10=\"Preço Unitário (R$)\",PO.CustoUnitario,ROUND(PO.CustoUnitario*(1+$Z43),15-13*$X$6)),0)","v":189.25},{"$f":"IF($A43=\"S\",VTOTAL1,IF($A43=0,0,ROUND(SomaAgrup,15-13*$X$7)))","v":18.93},{"$f":"IF($J43=\"\",\"\",IF($N43=\"\",\"DESCRIÇÃO\",IF(AND($J43=\"Serviço\",$O43=\"\"),\"UNIDADE\",IF($T43<=0,\"SEM VALOR\",IF(AND($Y43<>\"\",$Q43>$Y43),\"ACIMA REF.\",\"\")))))","v":""},{"$f":"IF(OR($A43=0,$A43=\"S\",$A43>CFF!$A$9),\"\",MAX(V$12:OFFSET(V43,-1,0))+1)","v":""},{"$f":"IF(AND($J43=\"Serviço\",$M43<>\"\"),IF($L43=\"\",$M43,CONCATENATE($L43,\"-\",$M43)))","v":"COMPOSIÇÃO-SINAPI100209ADAPTADA"},{"$f":"IF(AND(Fonte<>\"\",Código<>\"\"),MATCH(Fonte&\" \"&IF(Fonte=\"sinapi\",SUBSTITUTE(SUBSTITUTE(Código,\"/00\",\"/\"),\"/0\",\"/\"),Código),INDIRECT(\"'[Referência \"&_xlnm.Database&\".xls]Banco'!$a:$a\"),0),\"X\")","v":12},{"$f":"IF(Import.Desoneracao=\"sim\",Referencia.Desonerado,Referencia.NaoDesonerado)","v":145.34},{"$f":"ROUND(IF(ISNUMBER(R43),R43,IF(LEFT(R43,3)=\"BDI\",HLOOKUP(R43,DADOS!$T$37:$X$38,2,FALSE),0)),15-11*$X$5)","v":0.30209999999999998}]
[3,5,1,3,2,0,0,5,99,"Nível 3","1.3.2.",null,null,"TETO",{"$f":"Referencia.Unidade","v":""},{"$f":"OFFSET(PLQ!$E$12,ROW($P44)-ROW(P$12),0)","v":0},null,"BDI 1",0,1694.9,"",{"$f":"IF(OR($A44=0,$A44=\"S\",$A44>CFF!$A$9),\"\",MAX(V$12:OFFSET(V44,-1,0))+1)","v":""},false,"X",{"$f":"IF(Import.Desoneracao=\"sim\",Referencia.Desonerado,Referencia.NaoDesonerado)","v":0},{"$f":"ROUND(IF(ISNUMBER(R44),R44,IF(LEFT(R44,3)=\"BDI\",HLOOKUP(R44,DADOS!$T$37:$X$38,2,FALSE),0)),15-11*$X$5)","v":0.30209999999999998}]
[4,2,1,3,2,1,0,{"$f":"IF(OR($A45=\"S\",$A45=0),0,MATCH(0,OFFSET($B45,1,$A45,ROW($A$145)-ROW($A45)),0))","v":4},{"$f":"IF(OR($A45=\"S\",$A45=0),0,MATCH(OFFSET($B45,0,$A45)+1,OFFSET($B45,1,$A45,ROW($A$145)-ROW($A45)),0))","v":2},"Nível 4","1.3.2.1.",null,null,"INTERNO",{"$f":"Referencia.Unidade","v":""},{"$f":"OFFSET(PLQ!$E$12,ROW($P45)-ROW(P$12),0)","v":0},null,"BDI 1",0,1137.58,"",{"$f":"IF(OR($A45=0,$A45=\"S\",$A45>CFF!$A$9),\"\",MAX(V$12:OFFSET(V45,-1,0))+1)","v":""},false,"X",{"$f":"IF(Import.Desoneracao=\"sim\",Referencia.Desonerado,Referencia.NaoDesonerado)","v":0},{"$f":"ROUND(IF(ISNUMBER(R45),R45,IF(LEFT(R45,3)=\"BDI\",HLOOKUP(R45,DADOS!$T$37:$X$38,2,FALSE),0)),15-11*$X$5)","v":0.30209999999999998}]
["S",0,1,3,2,1,1,0,0,"Serviço","1.3.2.1.1.","SINAPI","97631","DEMOLIÇÃO DE ARGAMASSAS, DE FORMA MANUAL, SEM REAPROVEITAMENTO. AF_09/2023","M2",{"$f":"OFFSET(PLQ!$E$12,ROW($P46)-ROW(P$12),0)","v":74.400000000000006},11.74,"BDI 1",15.29,1137.58,"",{"$f":"IF(OR($A46=0,$A46=\"S\",$A46>CFF!$A$9),\"\",MAX(V$12:OFFSET(V46,-1,0))+1)","v":""},"SINAPI-97631",7863,{"$f":"IF(Import.Desoneracao=\"sim\",Referencia.Desonerado,Referencia.NaoDesonerado)","v":11.74},{"$f":"ROUND(IF(ISNUMBER(R46),R46,IF(LEFT(R46,3)=\"BDI\",HLOOKUP(R46,DADOS!$T$37:$X$38,2,FALSE),0)),15-11*$X$5)","v":0.30209999999999998}]
[4,2,1,3,2,2,0,2,{"$error":"#N/A"},"Nível 4","1.3.2.2.",null,null,"EXTERNO",{"$f":"Referencia.Unidade","v":""},{"$f":"OFFSET(PLQ!$E$12,ROW($P47)-ROW(P$12),0)","v":0},null,"BDI 1",0,557.32000000000005,"",{"$f":"IF(OR($A47=0,$A47=\"S\",$A47>CFF!$A$9),\"\",MAX(V$12:OFFSET(V47,-1,0))+1)","v":""},false,"X",{"$f":"IF(Import.Desoneracao=\"sim\",Referencia.Desonerado,Referencia.NaoDesonerado)","v":0},{"$f":"ROUND(IF(ISNUMBER(R47),R47,IF(LEFT(R47,3)=\"BDI\",HLOOKUP(R47,DADOS!$T$37:$X$38,2,FALSE),0)),15-11*$X$5)","v":0.30209999999999998}]
["S",0,1,3,2,2,1,0,0,"Serviço","1.3.2.2.1.","SINAPI","97631","DEMOLIÇÃO DE ARGAMASSAS, DE FORMA MANUAL, SEM REAPROVEITAMENTO. AF_09/2023","M2",{"$f":"OFFSET(PLQ!$E$12,ROW($P48)-ROW(P$12),0)","v":36.450000000000003},11.74,"BDI 1",15.29,557.32000000000005,"",{"$f":"IF(OR($A48=0,$A48=\"S\",$A48>CFF!$A$9),\"\",MAX(V$12:OFFSET(V48,-1,0))+1)","v":""},"SINAPI-97631",7863,{"$f":"IF(Import.Desoneracao=\"sim\",Referencia.Desonerado,Referencia.NaoDesonerado)","v":11.74},{"$f":"ROUND(IF(ISNUMBER(R48),R48,IF(LEFT(R48,3)=\"BDI\",HLOOKUP(R48,DADOS!$T$37:$X$38,2,FALSE),0)),15-11*$X$5)","v":0.30209999999999998}]
[2,16,1,4,0,0,0,37,16,"Nível 2","1.4.",null,null,"SACADA",{"$f":"Referencia.Unidade","v":""},{"$f":"OFFSET(PLQ!$E$12,ROW($P49)-ROW(P$12),0)","v":0},null,"BDI 1",0,17329.759999999998,"",{"$f":"IF(OR($A49=0,$A49=\"S\",$A49>CFF!$A$9),\"\",MAX(V$12:OFFSET(V49,-1,0))+1)","v":5},false,"X",{"$f":"IF(Import.Desoneracao=\"sim\",Referencia.Desonerado,Referencia.NaoDesonerado)","v":0},{"$f":"ROUND(IF(ISNUMBER(R49),R49,IF(LEFT(R49,3)=\"BDI\",HLOOKUP(R49,DADOS!$T$37:$X$38,2,FALSE),0)),15-11*$X$5)","v":0.30209999999999998}]
[{"$f":"CHOOSE(1+LOG(1+2*(J50=\"Meta\")+4*(J50=\"Nível 2\")+8*(J50=\"Nível 3\")+16*(J50=\"Nível 4\")+32*(J50=\"Serviço\"),2),0,1,2,3,4,\"S\")","v":"S"},{"$f":"IF(OR(A50=\"S\",A50=0),0,IF(ISERROR(I50),H50,SMALL(H50:I50,1)))","v":0},{"$f":"IF($A50=1,OFFSET(C50,-1,0)+1,OFFSET(C50,-1,0))","v":1},{"$f":"IF($A50=1,0,IF($A50=2,OFFSET(D50,-1,0)+1,OFFSET(D50,-1,0)))","v":4},{"$f":"IF(AND($A50<=2,$A50<>0),0,IF($A50=3,OFFSET(E50,-1,0)+1,OFFSET(E50,-1,0)))","v":0},{"$f":"IF(AND($A50<=3,$A50<>0),0,IF($A50=4,OFFSET(F50,-1,0)+1,OFFSET(F50,-1,0)))","v":0},{"$f":"IF(AND($A50<=4,$A50<>0),0,IF($A50=\"S\",OFFSET(G50,-1,0)+1,OFFSET(G50,-1,0)))","v":1},0,0,"Serviço",{"$f":"IF($A50=0,\"-\",CONCATENATE(C50&\".\",IF(AND($A$5>=2,$A50>=2),D50&\".\",\"\"),IF(AND($A$5>=3,$A50>=3),E50&\".\",\"\"),IF(AND($A$5>=4,$A50>=4),F50&\".\",\"\"),IF($A50=\"S\",G50&\".\",\"\")))","v":"1.4.0.0.1."},"SINAPI","97640","REMOÇÃO DE FORROS DE DRYWALL, PVC E FIBROMINERAL, DE FORMA MANUAL, SEM REAPROVEITAMENTO. AF_09/2023","M2",{"$f":"OFFSET(PLQ!$E$12,ROW($P50)-ROW(P$12),0)","v":23},2.16,"BDI 1",{"$f":"IF($A50=\"S\",IF($Q$10=\"Preço Unitário (R$)\",PO.CustoUnitario,ROUND(PO.CustoUnitario*(1+$Z50),15-13*$X$6)),0)","v":2.81},{"$f":"IF($A50=\"S\",VTOTAL1,IF($A50=0,0,ROUND(SomaAgrup,15-13*$X$7)))","v":64.63},{"$f":"IF($J50=\"\",\"\",IF($N50=\"\",\"DESCRIÇÃO\",IF(AND($J50=\"Serviço\",$O50=\"\"),\"UNIDADE\",IF($T50<=0,\"SEM VALOR\",IF(AND($Y50<>\"\",$Q50>$Y50),\"ACIMA REF.\",\"\")))))","v":""},{"$f":"IF(OR($A50=0,$A50=\"S\",$A50>CFF!$A$9),\"\",MAX(V$12:OFFSET(V50,-1,0))+1)","v":""},{"$f":"IF(AND($J50=\"Serviço\",$M50<>\"\"),IF($L50=\"\",$M50,CONCATENATE($L50,\"-\",$M50)))","v":"SINAPI-97640"},{"$f":"IF(AND(Fonte<>\"\",Código<>\"\"),MATCH(Fonte&\" \"&IF(Fonte=\"sinapi\",SUBSTITUTE(SUBSTITUTE(Código,\"/00\",\"/\"),\"/0\",\"/\"),Código),INDIRECT(\"'[Referência \"&_xlnm.Database&\".xls]Banco'!$a:$a\"),0),\"X\")","v":7888},{"$f":"IF(Import.Desoneracao=\"sim\",Referencia.Desonerado,Referencia.NaoDesonerado)","v":2.16},{"$f":"ROUND(IF(ISNUMBER(R50),R50,IF(LEFT(R50,3)=\"BDI\",HLOOKUP(R50,DADOS!$T$37:$X$38,2,FALSE),0)),15-11*$X$5)","v":0.30209999999999998}]
["S",0,1,4,0,0,2,0,0,"Serviço","1.4.0.0.2.","SINAPI","97634","DEMOLIÇÃO DE REVESTIMENTO CERÂMICO, DE FORMA MECANIZADA COM MARTELETE, SEM REAPROVEITAMENTO. AF_09/2023","M2",{"$f":"OFFSET(PLQ!$E$12,ROW($P51)-ROW(P$12),0)","v":23},8.2100000000000009,"BDI 1",10.69,245.87,"",{"$f":"IF(OR($A51=0,$A51=\"S\",$A51>CFF!$A$9),\"\",MAX(V$12:OFFSET(V51,-1,0))+1)","v":""},"SINAPI-97634",7873,{"$f":"IF(Import.Desoneracao=\"sim\",Referencia.Desonerado,Referencia.NaoDesonerado)","v":8.2100000000000009},{"$f":"ROUND(IF(ISNUMBER(R51),R51,IF(LEFT(R51,3)=\"BDI\",HLOOKUP(R51,DADOS!$T$37:$X$38,2,FALSE),0)),15-11*$X$5)","v":0.30209999999999998}]
["S",0,1,4,0,0,3,0,0,"Serviço","1.4.0.0.3.","SINAPI","97632","DEMOLIÇÃO DE RODAPÉ CERÂMICO, DE FORMA MANUAL, SEM REAPROVEITAMENTO. AF_09/2023","M",{"$f":"OFFSET(PLQ!$E$12,ROW($P52)-ROW(P$12),0)","v":24.74},2.68,"BDI 1",3.49,86.34,"",{"$f":"IF(OR($A52=0,$A52=\"S\",$A52>CFF!$A$9),\"\",MAX(V$12:OFFSET(V52,-1,0))+1)","v":""},"SINAPI-97632",7874,{"$f":"IF(Import.Desoneracao=\"sim\",Referencia.Desonerado,Referencia.NaoDesonerado)","v":2.68},{"$f":"ROUND(IF(ISNUMBER(R52),R52,IF(LEFT(R52,3)=\"BDI\",HLOOKUP(R52,DADOS!$T$37:$X$38,2,FALSE),0)),15-11*$X$5)","v":0.30209999999999998}]
["S",0,1,4,0,0,4,0,0,"Serviço","1.4.0.0.4.","SINAPI","97631","DEMOLIÇÃO DE ARGAMASSAS, DE FORMA MANUAL, SEM REAPROVEITAMENTO. AF_09/2023","M2",{"$f":"OFFSET(PLQ!$E$12,ROW($P53)-ROW(P$12),0)","v":23},11.74,"BDI 1",15.29,351.67,"",{"$f":"IF(OR($A53=0,$A53=\"S\",$A53>CFF!$A$9),\"\",MAX(V$12:OFFSET(V53,-1,0))+1)","v":""},"SINAPI-97631",7863,{"$f":"IF(Import.Desoneracao=\"sim\",Referencia.Desonerado,Referencia.NaoDesonerado)","v":11.74},{"$f":"ROUND(IF(ISNUMBER(R53),R53,IF(LEFT(R53,3)=\"BDI\",HLOOKUP(R53,DADOS!$T$37:$X$38,2,FALSE),0)),15-11*$X$5)","v":0.30209999999999998}]
[{"$f":"CHOOSE(1+LOG(1+2*(J54=\"Meta\")+4*(J54=\"Nível 2\")+8*(J54=\"Nível 3\")+16*(J54=\"Nível 4\")+32*(J54=\"Serviço\"),2),0,1,2,3,4,\"S\")","v":"S"},{"$f":"IF(OR(A54=\"S\",A54=0),0,IF(ISERROR(I54),H54,SMALL(H54:I54,1)))","v":0},{"$f":"IF($A54=1,OFFSET(C54,-1,0)+1,OFFSET(C54,-1,0))","v":1},{"$f":"IF($A54=1,0,IF($A54=2,OFFSET(D54,-1,0)+1,OFFSET(D54,-1,0)))","v":4},{"$f":"IF(AND($A54<=2,$A54<>0),0,IF($A54=3,OFFSET(E54,-1,0)+1,OFFSET(E54,-1,0)))","v":0},{"$f":"IF(AND($A54<=3,$A54<>0),0,IF($A54=4,OFFSET(F54,-1,0)+1,OFFSET(F54,-1,0)))","v":0},{"$f":"IF(AND($A54<=4,$A54<>0),0,IF($A54=\"S\",OFFSET(G54,-1,0)+1,OFFSET(G54,-1,0)))","v":5},0,0,"Serviço",{"$f":"IF($A54=0,\"-\",CONCATENATE(C54&\".\",IF(AND($A$5>=2,$A54>=2),D54&\".\",\"\"),IF(AND($A$5>=3,$A54>=3),E54&\".\",\"\"),IF(AND($A$5>=4,$A54>=4),F54&\".\",\"\"),IF($A54=\"S\",G54&\".\",\"\")))","v":"1.4.0.0.5."},"COMPOSIÇÃO","SINAPI100209ADAPTADA","TRANSPORTE MANUAL DE REVESTIMENTOS ARGAMASSADOS REMOVIDOS COM CARRINHO DE MÃO 45L - INCLUSO CARGA E DESCARGA","M3XKM",{"$f":"OFFSET(PLQ!$E$12,ROW($P54)-ROW(P$12),0)","v":0.02},145.34,"BDI 1",{"$f":"IF($A54=\"S\",IF($Q$10=\"Preço Unitário (R$)\",PO.CustoUnitario,ROUND(PO.CustoUnitario*(1+$Z54),15-13*$X$6)),0)","v":189.25},{"$f":"IF($A54=\"S\",VTOTAL1,IF($A54=0,0,ROUND(SomaAgrup,15-13*$X$7)))","v":3.79},{"$f":"IF($J54=\"\",\"\",IF($N54=\"\",\"DESCRIÇÃO\",IF(AND($J54=\"Serviço\",$O54=\"\"),\"UNIDADE\",IF($T54<=0,\"SEM VALOR\",IF(AND($Y54<>\"\",$Q54>$Y54),\"ACIMA REF.\",\"\")))))","v":""},{"$f":"IF(OR($A54=0,$A54=\"S\",$A54>CFF!$A$9),\"\",MAX(V$12:OFFSET(V54,-1,0))+1)","v":""},{"$f":"IF(AND($J54=\"Serviço\",$M54<>\"\"),IF($L54=\"\",$M54,CONCATENATE($L54,\"-\",$M54)))","v":"COMPOSIÇÃO-SINAPI100209ADAPTADA"},{"$f":"IF(AND(Fonte<>\"\",Código<>\"\"),MATCH(Fonte&\" \"&IF(Fonte=\"sinapi\",SUBSTITUTE(SUBSTITUTE(Código,\"/00\",\"/\"),\"/0\",\"/\"),Código),INDIRECT(\"'[Referência \"&_xlnm.Database&\".xls]Banco'!$a:$a\"),0),\"X\")","v":12},{"$f":"IF(Import.Desoneracao=\"sim\",Referencia.Desonerado,Referencia.NaoDesonerado)","v":145.34},{"$f":"ROUND(IF(ISNUMBER(R54),R54,IF(LEFT(R54,3)=\"BDI\",HLOOKUP(R54,DADOS!$T$37:$X$38,2,FALSE),0)),15-11*$X$5)","v":0.30209999999999998}]
[{"$f":"CHOOSE(1+LOG(1+2*(J55=\"Meta\")+4*(J55=\"Nível 2\")+8*(J55=\"Nível 3\")+16*(J55=\"Nível 4\")+32*(J55=\"Serviço\"),2),0,1,2,3,4,\"S\")","v":"S"},{"$f":"IF(OR(A55=\"S\",A55=0),0,IF(ISERROR(I55),H55,SMALL(H55:I55,1)))","v":0},{"$f":"IF($A55=1,OFFSET(C55,-1,0)+1,OFFSET(C55,-1,0))","v":1},{"$f":"IF($A55=1,0,IF($A55=2,OFFSET(D55,-1,0)+1,OFFSET(D55,-1,0)))","v":4},{"$f":"IF(AND($A55<=2,$A55<>0),0,IF($A55=3,OFFSET(E55,-1,0)+1,OFFSET(E55,-1,0)))","v":0},{"$f":"IF(AND($A55<=3,$A55<>0),0,IF($A55=4,OFFSET(F55,-1,0)+1,OFFSET(F55,-1,0)))","v":0},{"$f":"IF(AND($A55<=4,$A55<>0),0,IF($A55=\"S\",OFFSET(G55,-1,0)+1,OFFSET(G55,-1,0)))","v":6},0,0,"Serviço",{"$f":"IF($A55=0,\"-\",CONCATENATE(C55&\".\",IF(AND($A$5>=2,$A55>=2),D55&\".\",\"\"),IF(AND($A$5>=3,$A55>=3),E55&\".\",\"\"),IF(AND($A$5>=4,$A55>=4),F55&\".\",\"\"),IF($A55=\"S\",G55&\".\",\"\")))","v":"1.4.0.0.6."},"SINAPI","89710","RALO SECO, PVC, DN 100 X 40 MM, JUNTA SOLDÁVEL, FORNECIDO E INSTALADO EM RAMAL DE DESCARGA OU EM RAMAL DE ESGOTO SANITÁRIO. AF_08/2022","UN",{"$f":"OFFSET(PLQ!$E$12,ROW($P55)-ROW(P$12),0)","v":2},18.71,"BDI 1",{"$f":"IF($A55=\"S\",IF($Q$10=\"Preço Unitário (R$)\",PO.CustoUnitario,ROUND(PO.CustoUnitario*(1+$Z55),15-13*$X$6)),0)","v":24.36},{"$f":"IF($A55=\"S\",VTOTAL1,IF($A55=0,0,ROUND(SomaAgrup,15-13*$X$7)))","v":48.72},{"$f":"IF($J55=\"\",\"\",IF($N55=\"\",\"DESCRIÇÃO\",IF(AND($J55=\"Serviço\",$O55=\"\"),\"UNIDADE\",IF($T55<=0,\"SEM VALOR\",IF(AND($Y55<>\"\",$Q55>$Y55),\"ACIMA REF.\",\"\")))))","v":""},{"$f":"IF(OR($A55=0,$A55=\"S\",$A55>CFF!$A$9),\"\",MAX(V$12:OFFSET(V55,-1,0))+1)","v":""},{"$f":"IF(AND($J55=\"Serviço\",$M55<>\"\"),IF($L55=\"\",$M55,CONCATENATE($L55,\"-\",$M55)))","v":"SINAPI-89710"},{"$f":"IF(AND(Fonte<>\"\",Código<>\"\"),MATCH(Fonte&\" \"&IF(Fonte=\"sinapi\",SUBSTITUTE(SUBSTITUTE(Código,\"/00\",\"/\"),\"/0\",\"/\"),Código),INDIRECT(\"'[Referência \"&_xlnm.Database&\".xls]Banco'!$a:$a\"),0),\"X\")","v":11364},{"$f":"IF(Import.Desoneracao=\"sim\",Referencia.Desonerado,Referencia.NaoDesonerado)","v":18.71},{"$f":"ROUND(IF(ISNUMBER(R55),R55,IF(LEFT(R55,3)=\"BDI\",HLOOKUP(R55,DADOS!$T$37:$X$38,2,FALSE),0)),15-11*$X$5)","v":0.30209999999999998}]
[{"$f":"CHOOSE(1+LOG(1+2*(J56=\"Meta\")+4*(J56=\"Nível 2\")+8*(J56=\"Nível 3\")+16*(J56=\"Nível 4\")+32*(J56=\"Serviço\"),2),0,1,2,3,4,\"S\")","v":"S"},{"$f":"IF(OR(A56=\"S\",A56=0),0,IF(ISERROR(I56),H56,SMALL(H56:I56,1)))","v":0},{"$f":"IF($A56=1,OFFSET(C56,-1,0)+1,OFFSET(C56,-1,0))","v":1},{"$f":"IF($A56=1,0,IF($A56=2,OFFSET(D56,-1,0)+1,OFFSET(D56,-1,0)))","v":4},{"$f":"IF(AND($A56<=2,$A56<>0),0,IF($A56=3,OFFSET(E56,-1,0)+1,OFFSET(E56,-1,0)))","v":0},{"$f":"IF(AND($A56<=3,$A56<>0),0,IF($A56=4,OFFSET(F56,-1,0)+1,OFFSET(F56,-1,0)))","v":0},{"$f":"IF(AND($A56<=4,$A56<>0),0,IF($A56=\"S\",OFFSET(G56,-1,0)+1,OFFSET(G56,-1,0)))","v":7},0,0,"Serviço",{"$f":"IF($A56=0,\"-\",CONCATENATE(C56&\".\",IF(AND($A$5>=2,$A56>=2),D56&\".\",\"\"),IF(AND($A$5>=3,$A56>=3),E56&\".\",\"\"),IF(AND($A$5>=4,$A56>=4),F56&\".\",\"\"),IF($A56=\"S\",G56&\".\",\"\")))","v":"1.4.0.0.7."},"SINAPI","89578","TUBO PVC, SÉRIE R, ÁGUA PLUVIAL, DN 100 MM, FORNECIDO E INSTALADO EM CONDUTORES VERTICAIS DE ÁGUAS PLUVIAIS. AF_06/2022","M",{"$f":"OFFSET(PLQ!$E$12,ROW($P56)-ROW(P$12),0)","v":7.2},36.950000000000003,"BDI 1",{"$f":"IF($A56=\"S\",IF($Q$10=\"Preço Unitário (R$)\",PO.CustoUnitario,ROUND(PO.CustoUnitario*(1+$Z56),15-13*$X$6)),0)","v":48.11},{"$f":"IF($A56=\"S\",VTOTAL1,IF($A56=0,0,ROUND(SomaAgrup,15-13*$X$7)))","v":346.39},{"$f":"IF($J56=\"\",\"\",IF($N56=\"\",\"DESCRIÇÃO\",IF(AND($J56=\"Serviço\",$O56=\"\"),\"UNIDADE\",IF($T56<=0,\"SEM VALOR\",IF(AND($Y56<>\"\",$Q56>$Y56),\"ACIMA REF.\",\"\")))))","v":""},{"$f":"IF(OR($A56=0,$A56=\"S\",$A56>CFF!$A$9),\"\",MAX(V$12:OFFSET(V56,-1,0))+1)","v":""},{"$f":"IF(AND($J56=\"Serviço\",$M56<>\"\"),IF($L56=\"\",$M56,CONCATENATE($L56,\"-\",$M56)))","v":"SINAPI-89578"},{"$f":"IF(AND(Fonte<>\"\",Código<>\"\"),MATCH(Fonte&\" \"&IF(Fonte=\"sinapi\",SUBSTITUTE(SUBSTITUTE(Código,\"/00\",\"/\"),\"/0\",\"/\"),Código),INDIRECT(\"'[Referência \"&_xlnm.Database&\".xls]Banco'!$a:$a\"),0),\"X\")","v":11891},{"$f":"IF(Import.Desoneracao=\"sim\",Referencia.Desonerado,Referencia.NaoDesonerado)","v":36.950000000000003},{"$f":"ROUND(IF(ISNUMBER(R56),R56,IF(LEFT(R56,3)=\"BDI\",HLOOKUP(R56,DADOS!$T$37:$X$38,2,FALSE),0)),15-11*$X$5)","v":0.30209999999999998}]
["S",0,1,4,0,0,8,0,0,"Serviço","1.4.0.0.8.","SINAPI","89529","JOELHO 90 GRAUS, PVC, SERIE R, ÁGUA PLUVIAL, DN 100 MM, JUNTA ELÁSTICA, FORNECIDO E INSTALADO EM RAMAL DE ENCAMINHAMENTO. AF_06/2022","UN",{"$f":"OFFSET(PLQ!$E$12,ROW($P57)-ROW(P$12),0)","v":2},40.14,"BDI 1",{"$f":"IF($A57=\"S\",IF($Q$10=\"Preço Unitário (R$)\",PO.CustoUnitario,ROUND(PO.CustoUnitario*(1+$Z57),15-13*$X$6)),0)","v":52.27},{"$f":"IF($A57=\"S\",VTOTAL1,IF($A57=0,0,ROUND(SomaAgrup,15-13*$X$7)))","v":104.54},"",{"$f":"IF(OR($A57=0,$A57=\"S\",$A57>CFF!$A$9),\"\",MAX(V$12:OFFSET(V57,-1,0))+1)","v":""},"SINAPI-89529",{"$f":"IF(AND(Fonte<>\"\",Código<>\"\"),MATCH(Fonte&\" \"&IF(Fonte=\"sinapi\",SUBSTITUTE(SUBSTITUTE(Código,\"/00\",\"/\"),\"/0\",\"/\"),Código),INDIRECT(\"'[Referência \"&_xlnm.Database&\".xls]Banco'!$a:$a\"),0),\"X\")","v":11851},{"$f":"IF(Import.Desoneracao=\"sim\",Referencia.Desonerado,Referencia.NaoDesonerado)","v":40.14},{"$f":"ROUND(IF(ISNUMBER(R57),R57,IF(LEFT(R57,3)=\"BDI\",HLOOKUP(R57,DADOS!$T$37:$X$38,2,FALSE),0)),15-11*$X$5)","v":0.30209999999999998}]
[{"$f":"CHOOSE(1+LOG(1+2*(J58=\"Meta\")+4*(J58=\"Nível 2\")+8*(J58=\"Nível 3\")+16*(J58=\"Nível 4\")+32*(J58=\"Serviço\"),2),0,1,2,3,4,\"S\")","v":"S"},{"$f":"IF(OR(A58=\"S\",A58=0),0,IF(ISERROR(I58),H58,SMALL(H58:I58,1)))","v":0},{"$f":"IF($A58=1,OFFSET(C58,-1,0)+1,OFFSET(C58,-1,0))","v":1},{"$f":"IF($A58=1,0,IF($A58=2,OFFSET(D58,-1,0)+1,OFFSET(D58,-1,0)))","v":4},{"$f":"IF(AND($A58<=2,$A58<>0),0,IF($A58=3,OFFSET(E58,-1,0)+1,OFFSET(E58,-1,0)))","v":0},{"$f":"IF(AND($A58<=3,$A58<>0),0,IF($A58=4,OFFSET(F58,-1,0)+1,OFFSET(F58,-1,0)))","v":0},{"$f":"IF(AND($A58<=4,$A58<>0),0,IF($A58=\"S\",OFFSET(G58,-1,0)+1,OFFSET(G58,-1,0)))","v":9},0,0,"Serviço",{"$f":"IF($A58=0,\"-\",CONCATENATE(C58&\".\",IF(AND($A$5>=2,$A58>=2),D58&\".\",\"\"),IF(AND($A$5>=3,$A58>=3),E58&\".\",\"\"),IF(AND($A$5>=4,$A58>=4),F58&\".\",\"\"),IF($A58=\"S\",G58&\".\",\"\")))","v":"1.4.0.0.9."},"SINAPI","87745","CONTRAPISO EM ARGAMASSA TRAÇO 1:4 (CIMENTO E AREIA), PREPARO MECÂNICO COM BETONEIRA 400 L, APLICADO EM ÁREAS MOLHADAS SOBRE LAJE, ADERIDO, ACABAMENTO NÃO REFORÇADO, ESPESSURA 3CM. AF_07/2021","M2",{"$f":"OFFSET(PLQ!$E$12,ROW($P58)-ROW(P$12),0)","v":23},56.5,"BDI 1",{"$f":"IF($A58=\"S\",IF($Q$10=\"Preço Unitário (R$)\",PO.CustoUnitario,ROUND(PO.CustoUnitario*(1+$Z58),15-13*$X$6)),0)","v":73.569999999999993},{"$f":"IF($A58=\"S\",VTOTAL1,IF($A58=0,0,ROUND(SomaAgrup,15-13*$X$7)))","v":1692.11},{"$f":"IF($J58=\"\",\"\",IF($N58=\"\",\"DESCRIÇÃO\",IF(AND($J58=\"Serviço\",$O58=\"\"),\"UNIDADE\",IF($T58<=0,\"SEM VALOR\",IF(AND($Y58<>\"\",$Q58>$Y58),\"ACIMA REF.\",\"\")))))","v":""},{"$f":"IF(OR($A58=0,$A58=\"S\",$A58>CFF!$A$9),\"\",MAX(V$12:OFFSET(V58,-1,0))+1)","v":""},{"$f":"IF(AND($J58=\"Serviço\",$M58<>\"\"),IF($L58=\"\",$M58,CONCATENATE($L58,\"-\",$M58)))","v":"SINAPI-87745"},7453,56.5,{"$f":"ROUND(IF(ISNUMBER(R58),R58,IF(LEFT(R58,3)=\"BDI\",HLOOKUP(R58,DADOS!$T$37:$X$38,2,FALSE),0)),15-11*$X$5)","v":0.30209999999999998}]
[{"$f":"CHOOSE(1+LOG(1+2*(J59=\"Meta\")+4*(J59=\"Nível 2\")+8*(J59=\"Nível 3\")+16*(J59=\"Nível 4\")+32*(J59=\"Serviço\"),2),0,1,2,3,4,\"S\")","v":"S"},{"$f":"IF(OR(A59=\"S\",A59=0),0,IF(ISERROR(I59),H59,SMALL(H59:I59,1)))","v":0},{"$f":"IF($A59=1,OFFSET(C59,-1,0)+1,OFFSET(C59,-1,0))","v":1},{"$f":"IF($A59=1,0,IF($A59=2,OFFSET(D59,-1,0)+1,OFFSET(D59,-1,0)))","v":4},{"$f":"IF(AND($A59<=2,$A59<>0),0,IF($A59=3,OFFSET(E59,-1,0)+1,OFFSET(E59,-1,0)))","v":0},{"$f":"IF(AND($A59<=3,$A59<>0),0,IF($A59=4,OFFSET(F59,-1,0)+1,OFFSET(F59,-1,0)))","v":0},{"$f":"IF(AND($A59<=4,$A59<>0),0,IF($A59=\"S\",OFFSET(G59,-1,0)+1,OFFSET(G59,-1,0)))","v":10},0,0,"Serviço",{"$f":"IF($A59=0,\"-\",CONCATENATE(C59&\".\",IF(AND($A$5>=2,$A59>=2),D59&\".\",\"\"),IF(AND($A$5>=3,$A59>=3),E59&\".\",\"\"),IF(AND($A$5>=4,$A59>=4),F59&\".\",\"\"),IF($A59=\"S\",G59&\".\",\"\")))","v":"1.4.0.0.10."},"SINAPI","98553","IMPERMEABILIZAÇÃO DE SUPERFÍCIE COM MEMBRANA À BASE DE POLIURETANO, 2 DEMÃOS. AF_09/2023","M2",{"$f":"OFFSET(PLQ!$E$12,ROW($P59)-ROW(P$12),0)","v":28.97},171.3,"BDI 1",223.05,6461.76,{"$f":"IF($J59=\"\",\"\",IF($N59=\"\",\"DESCRIÇÃO\",IF(AND($J59=\"Serviço\",$O59=\"\"),\"UNIDADE\",IF($T59<=0,\"SEM VALOR\",IF(AND($Y59<>\"\",$Q59>$Y59),\"ACIMA REF.\",\"\")))))","v":""},{"$f":"IF(OR($A59=0,$A59=\"S\",$A59>CFF!$A$9),\"\",MAX(V$12:OFFSET(V59,-1,0))+1)","v":""},{"$f":"IF(AND($J59=\"Serviço\",$M59<>\"\"),IF($L59=\"\",$M59,CONCATENATE($L59,\"-\",$M59)))","v":"SINAPI-98553"},10344,171.3,{"$f":"ROUND(IF(ISNUMBER(R59),R59,IF(LEFT(R59,3)=\"BDI\",HLOOKUP(R59,DADOS!$T$37:$X$38,2,FALSE),0)),15-11*$X$5)","v":0.30209999999999998}]
[{"$f":"CHOOSE(1+LOG(1+2*(J60=\"Meta\")+4*(J60=\"Nível 2\")+8*(J60=\"Nível 3\")+16*(J60=\"Nível 4\")+32*(J60=\"Serviço\"),2),0,1,2,3,4,\"S\")","v":"S"},{"$f":"IF(OR(A60=\"S\",A60=0),0,IF(ISERROR(I60),H60,SMALL(H60:I60,1)))","v":0},{"$f":"IF($A60=1,OFFSET(C60,-1,0)+1,OFFSET(C60,-1,0))","v":1},{"$f":"IF($A60=1,0,IF($A60=2,OFFSET(D60,-1,0)+1,OFFSET(D60,-1,0)))","v":4},{"$f":"IF(AND($A60<=2,$A60<>0),0,IF($A60=3,OFFSET(E60,-1,0)+1,OFFSET(E60,-1,0)))","v":0},{"$f":"IF(AND($A60<=3,$A60<>0),0,IF($A60=4,OFFSET(F60,-1,0)+1,OFFSET(F60,-1,0)))","v":0},{"$f":"IF(AND($A60<=4,$A60<>0),0,IF($A60=\"S\",OFFSET(G60,-1,0)+1,OFFSET(G60,-1,0)))","v":11},0,0,"Serviço",{"$f":"IF($A60=0,\"-\",CONCATENATE(C60&\".\",IF(AND($A$5>=2,$A60>=2),D60&\".\",\"\"),IF(AND($A$5>=3,$A60>=3),E60&\".\",\"\"),IF(AND($A$5>=4,$A60>=4),F60&\".\",\"\"),IF($A60=\"S\",G60&\".\",\"\")))","v":"1.4.0.0.11."},"SINAPI-I","4030","VEU DE POLIESTER PARA IMPERMEABILIZACAO","M2",{"$f":"OFFSET(PLQ!$E$12,ROW($P60)-ROW(P$12),0)","v":28.97},6.8,"BDI 1",8.85,256.38,{"$f":"IF($J60=\"\",\"\",IF($N60=\"\",\"DESCRIÇÃO\",IF(AND($J60=\"Serviço\",$O60=\"\"),\"UNIDADE\",IF($T60<=0,\"SEM VALOR\",IF(AND($Y60<>\"\",$Q60>$Y60),\"ACIMA REF.\",\"\")))))","v":""},{"$f":"IF(OR($A60=0,$A60=\"S\",$A60>CFF!$A$9),\"\",MAX(V$12:OFFSET(V60,-1,0))+1)","v":""},{"$f":"IF(AND($J60=\"Serviço\",$M60<>\"\"),IF($L60=\"\",$M60,CONCATENATE($L60,\"-\",$M60)))","v":"SINAPI-I-4030"},{"$f":"IF(AND(Fonte<>\"\",Código<>\"\"),MATCH(Fonte&\" \"&IF(Fonte=\"sinapi\",SUBSTITUTE(SUBSTITUTE(Código,\"/00\",\"/\"),\"/0\",\"/\"),Código),INDIRECT(\"'[Referência \"&_xlnm.Database&\".xls]Banco'!$a:$a\"),0),\"X\")","v":4958},{"$f":"IF(Import.Desoneracao=\"sim\",Referencia.Desonerado,Referencia.NaoDesonerado)","v":6.8},{"$f":"ROUND(IF(ISNUMBER(R60),R60,IF(LEFT(R60,3)=\"BDI\",HLOOKUP(R60,DADOS!$T$37:$X$38,2,FALSE),0)),15-11*$X$5)","v":0.30209999999999998}]
["S",0,1,4,0,0,12,0,0,"Serviço","1.4.0.0.12.","SINAPI","104596","REVESTIMENTO CERÂMICO PARA PISO COM PLACAS TIPO PORCELANATO DE DIMENSÕES 80X80 CM APLICADA EM AMBIENTES DE ÁREA MENOR QUE 5 M². AF_02/2023_PE","M2",{"$f":"OFFSET(PLQ!$E$12,ROW($P61)-ROW(P$12),0)","v":23},143.37,"BDI 1",186.68,4293.6400000000003,"",{"$f":"IF(OR($A61=0,$A61=\"S\",$A61>CFF!$A$9),\"\",MAX(V$12:OFFSET(V61,-1,0))+1)","v":""},"SINAPI-104596",14859,{"$f":"IF(Import.Desoneracao=\"sim\",Referencia.Desonerado,Referencia.NaoDesonerado)","v":143.37},{"$f":"ROUND(IF(ISNUMBER(R61),R61,IF(LEFT(R61,3)=\"BDI\",HLOOKUP(R61,DADOS!$T$37:$X$38,2,FALSE),0)),15-11*$X$5)","v":0.30209999999999998}]
["S",0,1,4,0,0,13,0,0,"Serviço","1.4.0.0.13.","SINAPI","104619","RODAPÉ CERÂMICO DE 7CM DE ALTURA COM PLACAS TIPO ESMALTADA DE DIMENSÕES 80X80CM. AF_02/2023","M",{"$f":"OFFSET(PLQ!$E$12,ROW($P62)-ROW(P$12),0)","v":24.74},14.45,"BDI 1",18.82,465.61,"",{"$f":"IF(OR($A62=0,$A62=\"S\",$A62>CFF!$A$9),\"\",MAX(V$12:OFFSET(V62,-1,0))+1)","v":""},"SINAPI-104619",14863,{"$f":"IF(Import.Desoneracao=\"sim\",Referencia.Desonerado,Referencia.NaoDesonerado)","v":14.45},{"$f":"ROUND(IF(ISNUMBER(R62),R62,IF(LEFT(R62,3)=\"BDI\",HLOOKUP(R62,DADOS!$T$37:$X$38,2,FALSE),0)),15-11*$X$5)","v":0.30209999999999998}]
[{"$f":"CHOOSE(1+LOG(1+2*(J63=\"Meta\")+4*(J63=\"Nível 2\")+8*(J63=\"Nível 3\")+16*(J63=\"Nível 4\")+32*(J63=\"Serviço\"),2),0,1,2,3,4,\"S\")","v":"S"},{"$f":"IF(OR(A63=\"S\",A63=0),0,IF(ISERROR(I63),H63,SMALL(H63:I63,1)))","v":0},{"$f":"IF($A63=1,OFFSET(C63,-1,0)+1,OFFSET(C63,-1,0))","v":1},{"$f":"IF($A63=1,0,IF($A63=2,OFFSET(D63,-1,0)+1,OFFSET(D63,-1,0)))","v":4},{"$f":"IF(AND($A63<=2,$A63<>0),0,IF($A63=3,OFFSET(E63,-1,0)+1,OFFSET(E63,-1,0)))","v":0},{"$f":"IF(AND($A63<=3,$A63<>0),0,IF($A63=4,OFFSET(F63,-1,0)+1,OFFSET(F63,-1,0)))","v":0},{"$f":"IF(AND($A63<=4,$A63<>0),0,IF($A63=\"S\",OFFSET(G63,-1,0)+1,OFFSET(G63,-1,0)))","v":14},0,0,"Serviço",{"$f":"IF($A63=0,\"-\",CONCATENATE(C63&\".\",IF(AND($A$5>=2,$A63>=2),D63&\".\",\"\"),IF(AND($A$5>=3,$A63>=3),E63&\".\",\"\"),IF(AND($A$5>=4,$A63>=4),F63&\".\",\"\"),IF($A63=\"S\",G63&\".\",\"\")))","v":"1.4.0.0.14."},"SINAPI","96485","FORRO EM RÉGUAS DE PVC, LISO, PARA AMBIENTES RESIDENCIAIS, INCLUSIVE ESTRUTURA UNIDIRECIONAL DE FIXAÇÃO. AF_08/2023_PS","M2",{"$f":"OFFSET(PLQ!$E$12,ROW($P63)-ROW(P$12),0)","v":23},90.14,"BDI 1",{"$f":"IF($A63=\"S\",IF($Q$10=\"Preço Unitário (R$)\",PO.CustoUnitario,ROUND(PO.CustoUnitario*(1+$Z63),15-13*$X$6)),0)","v":117.37},{"$f":"IF($A63=\"S\",VTOTAL1,IF($A63=0,0,ROUND(SomaAgrup,15-13*$X$7)))","v":2699.51},{"$f":"IF($J63=\"\",\"\",IF($N63=\"\",\"DESCRIÇÃO\",IF(AND($J63=\"Serviço\",$O63=\"\"),\"UNIDADE\",IF($T63<=0,\"SEM VALOR\",IF(AND($Y63<>\"\",$Q63>$Y63),\"ACIMA REF.\",\"\")))))","v":""},{"$f":"IF(OR($A63=0,$A63=\"S\",$A63>CFF!$A$9),\"\",MAX(V$12:OFFSET(V63,-1,0))+1)","v":""},{"$f":"IF(AND($J63=\"Serviço\",$M63<>\"\"),IF($L63=\"\",$M63,CONCATENATE($L63,\"-\",$M63)))","v":"SINAPI-96485"},9931,{"$f":"IF(Import.Desoneracao=\"sim\",Referencia.Desonerado,Referencia.NaoDesonerado)","v":90.14},{"$f":"ROUND(IF(ISNUMBER(R63),R63,IF(LEFT(R63,3)=\"BDI\",HLOOKUP(R63,DADOS!$T$37:$X$38,2,FALSE),0)),15-11*$X$5)","v":0.30209999999999998}]
[{"$f":"CHOOSE(1+LOG(1+2*(J64=\"Meta\")+4*(J64=\"Nível 2\")+8*(J64=\"Nível 3\")+16*(J64=\"Nível 4\")+32*(J64=\"Serviço\"),2),0,1,2,3,4,\"S\")","v":"S"},{"$f":"IF(OR(A64=\"S\",A64=0),0,IF(ISERROR(I64),H64,SMALL(H64:I64,1)))","v":0},{"$f":"IF($A64=1,OFFSET(C64,-1,0)+1,OFFSET(C64,-1,0))","v":1},{"$f":"IF($A64=1,0,IF($A64=2,OFFSET(D64,-1,0)+1,OFFSET(D64,-1,0)))","v":4},{"$f":"IF(AND($A64<=2,$A64<>0),0,IF($A64=3,OFFSET(E64,-1,0)+1,OFFSET(E64,-1,0)))","v":0},{"$f":"IF(AND($A64<=3,$A64<>0),0,IF($A64=4,OFFSET(F64,-1,0)+1,OFFSET(F64,-1,0)))","v":0},{"$f":"IF(AND($A64<=4,$A64<>0),0,IF($A64=\"S\",OFFSET(G64,-1,0)+1,OFFSET(G64,-1,0)))","v":15},0,0,"Serviço",{"$f":"IF($A64=0,\"-\",CONCATENATE(C64&\".\",IF(AND($A$5>=2,$A64>=2),D64&\".\",\"\"),IF(AND($A$5>=3,$A64>=3),E64&\".\",\"\"),IF(AND($A$5>=4,$A64>=4),F64&\".\",\"\"),IF($A64=\"S\",G64&\".\",\"\")))","v":"1.4.0.0.15."},"SINAPI-I","36246","ACABAMENTO SIMPLES/CONVENCIONAL PARA FORRO PVC, TIPO \"U\" OU \"C\", COR BRANCA, COMPRIMENTO 6 M","M",{"$f":"OFFSET(PLQ!$E$12,ROW($P64)-ROW(P$12),0)","v":28.14},5.7,"BDI 1",{"$f":"IF($A64=\"S\",IF($Q$10=\"Preço Unitário (R$)\",PO.CustoUnitario,ROUND(PO.CustoUnitario*(1+$Z64),15-13*$X$6)),0)","v":7.42},{"$f":"IF($A64=\"S\",VTOTAL1,IF($A64=0,0,ROUND(SomaAgrup,15-13*$X$7)))","v":208.8},{"$f":"IF($J64=\"\",\"\",IF($N64=\"\",\"DESCRIÇÃO\",IF(AND($J64=\"Serviço\",$O64=\"\"),\"UNIDADE\",IF($T64<=0,\"SEM VALOR\",IF(AND($Y64<>\"\",$Q64>$Y64),\"ACIMA REF.\",\"\")))))","v":""},{"$f":"IF(OR($A64=0,$A64=\"S\",$A64>CFF!$A$9),\"\",MAX(V$12:OFFSET(V64,-1,0))+1)","v":""},{"$f":"IF(AND($J64=\"Serviço\",$M64<>\"\"),IF($L64=\"\",$M64,CONCATENATE($L64,\"-\",$M64)))","v":"SINAPI-I-36246"},70,{"$f":"IF(Import.Desoneracao=\"sim\",Referencia.Desonerado,Referencia.NaoDesonerado)","v":5.7},{"$f":"ROUND(IF(ISNUMBER(R64),R64,IF(LEFT(R64,3)=\"BDI\",HLOOKUP(R64,DADOS!$T$37:$X$38,2,FALSE),0)),15-11*$X$5)","v":0.30209999999999998}]
[{"$f":"CHOOSE(1+LOG(1+2*(J65=\"Meta\")+4*(J65=\"Nível 2\")+8*(J65=\"Nível 3\")+16*(J65=\"Nível 4\")+32*(J65=\"Serviço\"),2),0,1,2,3,4,\"S\")","v":2},{"$f":"IF(OR(A65=\"S\",A65=0),0,IF(ISERROR(I65),H65,SMALL(H65:I65,1)))","v":2},{"$f":"IF($A65=1,OFFSET(C65,-1,0)+1,OFFSET(C65,-1,0))","v":1},{"$f":"IF($A65=1,0,IF($A65=2,OFFSET(D65,-1,0)+1,OFFSET(D65,-1,0)))","v":5},{"$f":"IF(AND($A65<=2,$A65<>0),0,IF($A65=3,OFFSET(E65,-1,0)+1,OFFSET(E65,-1,0)))","v":0},{"$f":"IF(AND($A65<=3,$A65<>0),0,IF($A65=4,OFFSET(F65,-1,0)+1,OFFSET(F65,-1,0)))","v":0},{"$f":"IF(AND($A65<=4,$A65<>0),0,IF($A65=\"S\",OFFSET(G65,-1,0)+1,OFFSET(G65,-1,0)))","v":0},21,2,"Nível 2",{"$f":"IF($A65=0,\"-\",CONCATENATE(C65&\".\",IF(AND($A$5>=2,$A65>=2),D65&\".\",\"\"),IF(AND($A$5>=3,$A65>=3),E65&\".\",\"\"),IF(AND($A$5>=4,$A65>=4),F65&\".\",\"\"),IF($A65=\"S\",G65&\".\",\"\")))","v":"1.5."},null,null,"TRATAMENTO DE TRINCAS E FISSURAS",{"$f":"Referencia.Unidade","v":""},{"$f":"OFFSET(PLQ!$E$12,ROW($P65)-ROW(P$12),0)","v":0},null,"BDI 1",{"$f":"IF($A65=\"S\",IF($Q$10=\"Preço Unitário (R$)\",PO.CustoUnitario,ROUND(PO.CustoUnitario*(1+$Z65),15-13*$X$6)),0)","v":0},{"$f":"IF($A65=\"S\",VTOTAL1,IF($A65=0,0,ROUND(SomaAgrup,15-13*$X$7)))","v":1115.7},{"$f":"IF($J65=\"\",\"\",IF($N65=\"\",\"DESCRIÇÃO\",IF(AND($J65=\"Serviço\",$O65=\"\"),\"UNIDADE\",IF($T65<=0,\"SEM VALOR\",IF(AND($Y65<>\"\",$Q65>$Y65),\"ACIMA REF.\",\"\")))))","v":""},{"$f":"IF(OR($A65=0,$A65=\"S\",$A65>CFF!$A$9),\"\",MAX(V$12:OFFSET(V65,-1,0))+1)","v":6},{"$f":"IF(AND($J65=\"Serviço\",$M65<>\"\"),IF($L65=\"\",$M65,CONCATENATE($L65,\"-\",$M65)))","v":false},"X",{"$f":"IF(Import.Desoneracao=\"sim\",Referencia.Desonerado,Referencia.NaoDesonerado)","v":0},{"$f":"ROUND(IF(ISNUMBER(R65),R65,IF(LEFT(R65,3)=\"BDI\",HLOOKUP(R65,DADOS!$T$37:$X$38,2,FALSE),0)),15-11*$X$5)","v":0.30209999999999998}]
["S",0,1,5,0,0,1,0,0,"Serviço","1.5.0.0.1.","SINAPI","98556","IMPERMEABILIZAÇÃO DE SUPERFÍCIE COM ARGAMASSA POLIMÉRICA / MEMBRANA ACRÍLICA, 4 DEMÃOS, REFORÇADA COM VÉU DE POLIÉSTER (MAV). AF_09/2023","M2",{"$f":"OFFSET(PLQ!$E$12,ROW($P66)-ROW(P$12),0)","v":15},57.12,"BDI 1",{"$f":"IF($A66=\"S\",IF($Q$10=\"Preço Unitário (R$)\",PO.CustoUnitario,ROUND(PO.CustoUnitario*(1+$Z66),15-13*$X$6)),0)","v":74.38},{"$f":"IF($A66=\"S\",VTOTAL1,IF($A66=0,0,ROUND(SomaAgrup,15-13*$X$7)))","v":1115.7},"",{"$f":"IF(OR($A66=0,$A66=\"S\",$A66>CFF!$A$9),\"\",MAX(V$12:OFFSET(V66,-1,0))+1)","v":""},"SINAPI-98556",10338,{"$f":"IF(Import.Desoneracao=\"sim\",Referencia.Desonerado,Referencia.NaoDesonerado)","v":57.12},{"$f":"ROUND(IF(ISNUMBER(R66),R66,IF(LEFT(R66,3)=\"BDI\",HLOOKUP(R66,DADOS!$T$37:$X$38,2,FALSE),0)),15-11*$X$5)","v":0.30209999999999998}]
[{"$f":"CHOOSE(1+LOG(1+2*(J67=\"Meta\")+4*(J67=\"Nível 2\")+8*(J67=\"Nível 3\")+16*(J67=\"Nível 4\")+32*(J67=\"Serviço\"),2),0,1,2,3,4,\"S\")","v":2},{"$f":"IF(OR(A67=\"S\",A67=0),0,IF(ISERROR(I67),H67,SMALL(H67:I67,1)))","v":12},{"$f":"IF($A67=1,OFFSET(C67,-1,0)+1,OFFSET(C67,-1,0))","v":1},{"$f":"IF($A67=1,0,IF($A67=2,OFFSET(D67,-1,0)+1,OFFSET(D67,-1,0)))","v":6},{"$f":"IF(AND($A67<=2,$A67<>0),0,IF($A67=3,OFFSET(E67,-1,0)+1,OFFSET(E67,-1,0)))","v":0},{"$f":"IF(AND($A67<=3,$A67<>0),0,IF($A67=4,OFFSET(F67,-1,0)+1,OFFSET(F67,-1,0)))","v":0},{"$f":"IF(AND($A67<=4,$A67<>0),0,IF($A67=\"S\",OFFSET(G67,-1,0)+1,OFFSET(G67,-1,0)))","v":0},19,12,"Nível 2",{"$f":"IF($A67=0,\"-\",CONCATENATE(C67&\".\",IF(AND($A$5>=2,$A67>=2),D67&\".\",\"\"),IF(AND($A$5>=3,$A67>=3),E67&\".\",\"\"),IF(AND($A$5>=4,$A67>=4),F67&\".\",\"\"),IF($A67=\"S\",G67&\".\",\"\")))","v":"1.6."},null,null,"ESQUADRIAS","es",{"$f":"OFFSET(PLQ!$E$12,ROW($P67)-ROW(P$12),0)","v":0},null,"BDI 1",{"$f":"IF($A67=\"S\",IF($Q$10=\"Preço Unitário (R$)\",PO.CustoUnitario,ROUND(PO.CustoUnitario*(1+$Z67),15-13*$X$6)),0)","v":0},{"$f":"IF($A67=\"S\",VTOTAL1,IF($A67=0,0,ROUND(SomaAgrup,15-13*$X$7)))","v":93147.89},{"$f":"IF($J67=\"\",\"\",IF($N67=\"\",\"DESCRIÇÃO\",IF(AND($J67=\"Serviço\",$O67=\"\"),\"UNIDADE\",IF($T67<=0,\"SEM VALOR\",IF(AND($Y67<>\"\",$Q67>$Y67),\"ACIMA REF.\",\"\")))))","v":""},{"$f":"IF(OR($A67=0,$A67=\"S\",$A67>CFF!$A$9),\"\",MAX(V$12:OFFSET(V67,-1,0))+1)","v":7},{"$f":"IF(AND($J67=\"Serviço\",$M67<>\"\"),IF($L67=\"\",$M67,CONCATENATE($L67,\"-\",$M67)))","v":false},{"$f":"IF(AND(Fonte<>\"\",Código<>\"\"),MATCH(Fonte&\" \"&IF(Fonte=\"sinapi\",SUBSTITUTE(SUBSTITUTE(Código,\"/00\",\"/\"),\"/0\",\"/\"),Código),INDIRECT(\"'[Referência \"&_xlnm.Database&\".xls]Banco'!$a:$a\"),0),\"X\")","v":"X"},{"$f":"IF(Import.Desoneracao=\"sim\",Referencia.Desonerado,Referencia.NaoDesonerado)","v":0},{"$f":"ROUND(IF(ISNUMBER(R67),R67,IF(LEFT(R67,3)=\"BDI\",HLOOKUP(R67,DADOS!$T$37:$X$38,2,FALSE),0)),15-11*$X$5)","v":0.30209999999999998}]
["S",0,1,6,0,0,1,0,0,"Serviço","1.6.0.0.1.","SINAPI","97644","REMOÇÃO DE PORTAS, DE FORMA MANUAL, SEM REAPROVEITAMENTO. AF_09/2023","M2",{"$f":"OFFSET(PLQ!$E$12,ROW($P68)-ROW(P$12),0)","v":10},9.7899999999999991,"BDI 1",12.75,127.5,"",{"$f":"IF(OR($A68=0,$A68=\"S\",$A68>CFF!$A$9),\"\",MAX(V$12:OFFSET(V68,-1,0))+1)","v":""},"SINAPI-97644",7898,{"$f":"IF(Import.Desoneracao=\"sim\",Referencia.Desonerado,Referencia.NaoDesonerado)","v":9.7899999999999991},{"$f":"ROUND(IF(ISNUMBER(R68),R68,IF(LEFT(R68,3)=\"BDI\",HLOOKUP(R68,DADOS!$T$37:$X$38,2,FALSE),0)),15-11*$X$5)","v":0.30209999999999998}]
["S",0,1,6,0,0,2,0,0,"Serviço","1.6.0.0.2.","SINAPI","102191","REMOÇÃO DE VIDRO LISO COMUM DE ESQUADRIA COM BAGUETE DE ALUMÍNIO OU PVC. AF_01/2021","M2",{"$f":"OFFSET(PLQ!$E$12,ROW($P69)-ROW(P$12),0)","v":29.4},22.39,"BDI 1",29.15,857.01,"",{"$f":"IF(OR($A69=0,$A69=\"S\",$A69>CFF!$A$9),\"\",MAX(V$12:OFFSET(V69,-1,0))+1)","v":""},"SINAPI-102191",15637,{"$f":"IF(Import.Desoneracao=\"sim\",Referencia.Desonerado,Referencia.NaoDesonerado)","v":22.39},{"$f":"ROUND(IF(ISNUMBER(R69),R69,IF(LEFT(R69,3)=\"BDI\",HLOOKUP(R69,DADOS!$T$37:$X$38,2,FALSE),0)),15-11*$X$5)","v":0.30209999999999998}]
["S",0,1,6,0,0,3,0,0,"Serviço","1.6.0.0.3.","COTAÇÃO","RCV01","REMOÇÃO DE JANELAS DE ALUMÍNIO E VIDRO, COM REAPROVEITAMENTO, E REINSTALAÇÃO - INCLUSO MATERIAL PARA TODAS AS VEDAÇÕES NECESSÁRIAS","M2",{"$f":"OFFSET(PLQ!$E$12,ROW($P70)-ROW(P$12),0)","v":19.45},177.38,"BDI 1",230.97,4492.37,"ACIMA REF.",{"$f":"IF(OR($A70=0,$A70=\"S\",$A70>CFF!$A$9),\"\",MAX(V$12:OFFSET(V70,-1,0))+1)","v":""},"COTAÇÃO-RCV01",17,{"$f":"IF(Import.Desoneracao=\"sim\",Referencia.Desonerado,Referencia.NaoDesonerado)","v":0},{"$f":"ROUND(IF(ISNUMBER(R70),R70,IF(LEFT(R70,3)=\"BDI\",HLOOKUP(R70,DADOS!$T$37:$X$38,2,FALSE),0)),15-11*$X$5)","v":0.30209999999999998}]
["S",0,1,6,0,0,4,0,0,"Serviço","1.6.0.0.4.","COMPOSIÇÃO","SINAPI97644ADAPTADO","REMOÇÃO (COM REAPROVEITAMENTO) E REINSTALAÇÃO DE PORTA DE MADEIRA 3,40X210M - INCLUSO MATERIAIS NECESSÁRIOS PARA VEDAÇÃO","M2",{"$f":"OFFSET(PLQ!$E$12,ROW($P71)-ROW(P$12),0)","v":7.14},36.450000000000003,"BDI 1",47.46,338.86,"",{"$f":"IF(OR($A71=0,$A71=\"S\",$A71>CFF!$A$9),\"\",MAX(V$12:OFFSET(V71,-1,0))+1)","v":""},"COMPOSIÇÃO-SINAPI97644ADAPTADO",10,{"$f":"IF(Import.Desoneracao=\"sim\",Referencia.Desonerado,Referencia.NaoDesonerado)","v":36.450000000000003},{"$f":"ROUND(IF(ISNUMBER(R71),R71,IF(LEFT(R71,3)=\"BDI\",HLOOKUP(R71,DADOS!$T$37:$X$38,2,FALSE),0)),15-11*$X$5)","v":0.30209999999999998}]
[{"$f":"CHOOSE(1+LOG(1+2*(J72=\"Meta\")+4*(J72=\"Nível 2\")+8*(J72=\"Nível 3\")+16*(J72=\"Nível 4\")+32*(J72=\"Serviço\"),2),0,1,2,3,4,\"S\")","v":"S"},{"$f":"IF(OR(A72=\"S\",A72=0),0,IF(ISERROR(I72),H72,SMALL(H72:I72,1)))","v":0},{"$f":"IF($A72=1,OFFSET(C72,-1,0)+1,OFFSET(C72,-1,0))","v":1},{"$f":"IF($A72=1,0,IF($A72=2,OFFSET(D72,-1,0)+1,OFFSET(D72,-1,0)))","v":6},{"$f":"IF(AND($A72<=2,$A72<>0),0,IF($A72=3,OFFSET(E72,-1,0)+1,OFFSET(E72,-1,0)))","v":0},{"$f":"IF(AND($A72<=3,$A72<>0),0,IF($A72=4,OFFSET(F72,-1,0)+1,OFFSET(F72,-1,0)))","v":0},{"$f":"IF(AND($A72<=4,$A72<>0),0,IF($A72=\"S\",OFFSET(G72,-1,0)+1,OFFSET(G72,-1,0)))","v":5},0,0,"Serviço",{"$f":"IF($A72=0,\"-\",CONCATENATE(C72&\".\",IF(AND($A$5>=2,$A72>=2),D72&\".\",\"\"),IF(AND($A$5>=3,$A72>=3),E72&\".\",\"\"),IF(AND($A$5>=4,$A72>=4),F72&\".\",\"\"),IF($A72=\"S\",G72&\".\",\"\")))","v":"1.6.0.0.5."},"SINAPI","98556","IMPERMEABILIZAÇÃO DE SUPERFÍCIE COM ARGAMASSA POLIMÉRICA / MEMBRANA ACRÍLICA, 4 DEMÃOS, REFORÇADA COM VÉU DE POLIÉSTER (MAV). AF_09/2023","M2",{"$f":"OFFSET(PLQ!$E$12,ROW($P72)-ROW(P$12),0)","v":1.5},57.12,"BDI 1",{"$f":"IF($A72=\"S\",IF($Q$10=\"Preço Unitário (R$)\",PO.CustoUnitario,ROUND(PO.CustoUnitario*(1+$Z72),15-13*$X$6)),0)","v":74.38},{"$f":"IF($A72=\"S\",VTOTAL1,IF($A72=0,0,ROUND(SomaAgrup,15-13*$X$7)))","v":111.57},{"$f":"IF($J72=\"\",\"\",IF($N72=\"\",\"DESCRIÇÃO\",IF(AND($J72=\"Serviço\",$O72=\"\"),\"UNIDADE\",IF($T72<=0,\"SEM VALOR\",IF(AND($Y72<>\"\",$Q72>$Y72),\"ACIMA REF.\",\"\")))))","v":""},{"$f":"IF(OR($A72=0,$A72=\"S\",$A72>CFF!$A$9),\"\",MAX(V$12:OFFSET(V72,-1,0))+1)","v":""},{"$f":"IF(AND($J72=\"Serviço\",$M72<>\"\"),IF($L72=\"\",$M72,CONCATENATE($L72,\"-\",$M72)))","v":"SINAPI-98556"},{"$f":"IF(AND(Fonte<>\"\",Código<>\"\"),MATCH(Fonte&\" \"&IF(Fonte=\"sinapi\",SUBSTITUTE(SUBSTITUTE(Código,\"/00\",\"/\"),\"/0\",\"/\"),Código),INDIRECT(\"'[Referência \"&_xlnm.Database&\".xls]Banco'!$a:$a\"),0),\"X\")","v":10338},{"$f":"IF(Import.Desoneracao=\"sim\",Referencia.Desonerado,Referencia.NaoDesonerado)","v":57.12},{"$f":"ROUND(IF(ISNUMBER(R72),R72,IF(LEFT(R72,3)=\"BDI\",HLOOKUP(R72,DADOS!$T$37:$X$38,2,FALSE),0)),15-11*$X$5)","v":0.30209999999999998}]
["S",0,1,6,0,0,6,0,0,"Serviço","1.6.0.0.6.","COTAÇÃO","RCV02","PELE DE VIDRO LAMINADO REFLETIVO PRATA, ESPESSURA 4 MM + 4 MM - FORNECIMENTO E INSTALAÇÃO","M2",{"$f":"OFFSET(PLQ!$E$12,ROW($P73)-ROW(P$12),0)","v":28.67},{"$f":"Y73/P73","v":1203.3484478549005},"BDI 1",1566.88,44922.45,"",{"$f":"IF(OR($A73=0,$A73=\"S\",$A73>CFF!$A$9),\"\",MAX(V$12:OFFSET(V73,-1,0))+1)","v":""},"COTAÇÃO-RCV02",18,{"$f":"IF(Import.Desoneracao=\"sim\",Referencia.Desonerado,Referencia.NaoDesonerado)","v":34500},{"$f":"ROUND(IF(ISNUMBER(R73),R73,IF(LEFT(R73,3)=\"BDI\",HLOOKUP(R73,DADOS!$T$37:$X$38,2,FALSE),0)),15-11*$X$5)","v":0.30209999999999998}]
["S",0,1,6,0,0,7,0,0,"Serviço","1.6.0.0.7.","SINAPI","91338","PORTA DE ALUMÍNIO DE ABRIR COM LAMBRI, COM GUARNIÇÃO, FIXAÇÃO COM PARAFUSOS - FORNECIMENTO E INSTALAÇÃO. AF_12/2019","M2",{"$f":"OFFSET(PLQ!$E$12,ROW($P74)-ROW(P$12),0)","v":17.22},1072.1600000000001,"BDI 1",1396.06,24040.15,"",{"$f":"IF(OR($A74=0,$A74=\"S\",$A74>CFF!$A$9),\"\",MAX(V$12:OFFSET(V74,-1,0))+1)","v":""},"SINAPI-91338",9559,{"$f":"IF(Import.Desoneracao=\"sim\",Referencia.Desonerado,Referencia.NaoDesonerado)","v":1072.1600000000001},{"$f":"ROUND(IF(ISNUMBER(R74),R74,IF(LEFT(R74,3)=\"BDI\",HLOOKUP(R74,DADOS!$T$37:$X$38,2,FALSE),0)),15-11*$X$5)","v":0.30209999999999998}]
["S",0,1,6,0,0,8,0,0,"Serviço","1.6.0.0.8.","COMPOSIÇÃO","SINAPI98695ADAPTADA","PEITORIL/SOLEIRA EM MÁRMORE, COM FRISO PINGADEIRA, LARGURA 20CM, ESPESSURA 2,0CM, COM SELAMENTO EM PU - FORNECIMENTO E INSTALAÇÃO","M",{"$f":"OFFSET(PLQ!$E$12,ROW($P75)-ROW(P$12),0)","v":45.85},119.13,"BDI 1",155.12,7112.25,"",{"$f":"IF(OR($A75=0,$A75=\"S\",$A75>CFF!$A$9),\"\",MAX(V$12:OFFSET(V75,-1,0))+1)","v":""},"COMPOSIÇÃO-SINAPI98695ADAPTADA",9,119.13000000000001,{"$f":"ROUND(IF(ISNUMBER(R75),R75,IF(LEFT(R75,3)=\"BDI\",HLOOKUP(R75,DADOS!$T$37:$X$38,2,FALSE),0)),15-11*$X$5)","v":0.30209999999999998}]
["S",0,1,6,0,0,9,0,0,"Serviço","1.6.0.0.9.","SINAPI","105030","CONTRAVERGA MOLDADA IN LOCO EM CONCRETO, ESPESSURA DE *10* CM. AF_03/2024","M",{"$f":"OFFSET(PLQ!$E$12,ROW($P76)-ROW(P$12),0)","v":19.45},41,"BDI 1",53.39,1038.44,"",{"$f":"IF(OR($A76=0,$A76=\"S\",$A76>CFF!$A$9),\"\",MAX(V$12:OFFSET(V76,-1,0))+1)","v":""},"SINAPI-105030",{"$f":"IF(AND(Fonte<>\"\",Código<>\"\"),MATCH(Fonte&\" \"&IF(Fonte=\"sinapi\",SUBSTITUTE(SUBSTITUTE(Código,\"/00\",\"/\"),\"/0\",\"/\"),Código),INDIRECT(\"'[Referência \"&_xlnm.Database&\".xls]Banco'!$a:$a\"),0),\"X\")","v":15565},{"$f":"IF(Import.Desoneracao=\"sim\",Referencia.Desonerado,Referencia.NaoDesonerado)","v":41},{"$f":"ROUND(IF(ISNUMBER(R76),R76,IF(LEFT(R76,3)=\"BDI\",HLOOKUP(R76,DADOS!$T$37:$X$38,2,FALSE),0)),15-11*$X$5)","v":0.30209999999999998}]
[{"$f":"CHOOSE(1+LOG(1+2*(J77=\"Meta\")+4*(J77=\"Nível 2\")+8*(J77=\"Nível 3\")+16*(J77=\"Nível 4\")+32*(J77=\"Serviço\"),2),0,1,2,3,4,\"S\")","v":"S"},{"$f":"IF(OR(A77=\"S\",A77=0),0,IF(ISERROR(I77),H77,SMALL(H77:I77,1)))","v":0},{"$f":"IF($A77=1,OFFSET(C77,-1,0)+1,OFFSET(C77,-1,0))","v":1},{"$f":"IF($A77=1,0,IF($A77=2,OFFSET(D77,-1,0)+1,OFFSET(D77,-1,0)))","v":6},{"$f":"IF(AND($A77<=2,$A77<>0),0,IF($A77=3,OFFSET(E77,-1,0)+1,OFFSET(E77,-1,0)))","v":0},{"$f":"IF(AND($A77<=3,$A77<>0),0,IF($A77=4,OFFSET(F77,-1,0)+1,OFFSET(F77,-1,0)))","v":0},{"$f":"IF(AND($A77<=4,$A77<>0),0,IF($A77=\"S\",OFFSET(G77,-1,0)+1,OFFSET(G77,-1,0)))","v":10},{"$f":"IF(OR($A77=\"S\",$A77=0),0,MATCH(0,OFFSET($B77,1,$A77,ROW($A$145)-ROW($A77)),0))","v":0},{"$f":"IF(OR($A77=\"S\",$A77=0),0,MATCH(OFFSET($B77,0,$A77)+1,OFFSET($B77,1,$A77,ROW($A$145)-ROW($A77)),0))","v":0},"Serviço",{"$f":"IF($A77=0,\"-\",CONCATENATE(C77&\".\",IF(AND($A$5>=2,$A77>=2),D77&\".\",\"\"),IF(AND($A$5>=3,$A77>=3),E77&\".\",\"\"),IF(AND($A$5>=4,$A77>=4),F77&\".\",\"\"),IF($A77=\"S\",G77&\".\",\"\")))","v":"1.6.0.0.10."},"COMPOSIÇÃO","CONSORTE01","REQUADRO DE ESQUADRIA COM DEMOLIÇÃO E RECOMPOSIÇÃO DO REVESTIMENTO (BORDAS 30CM)","M",{"$f":"OFFSET(PLQ!$E$12,ROW($P77)-ROW(P$12),0)","v":90.1},78.92,"BDI 1",{"$f":"IF($A77=\"S\",IF($Q$10=\"Preço Unitário (R$)\",PO.CustoUnitario,ROUND(PO.CustoUnitario*(1+$Z77),15-13*$X$6)),0)","v":102.76},{"$f":"IF($A77=\"S\",VTOTAL1,IF($A77=0,0,ROUND(SomaAgrup,15-13*$X$7)))","v":9258.68},{"$f":"IF($J77=\"\",\"\",IF($N77=\"\",\"DESCRIÇÃO\",IF(AND($J77=\"Serviço\",$O77=\"\"),\"UNIDADE\",IF($T77<=0,\"SEM VALOR\",IF(AND($Y77<>\"\",$Q77>$Y77),\"ACIMA REF.\",\"\")))))","v":""},{"$f":"IF(OR($A77=0,$A77=\"S\",$A77>CFF!$A$9),\"\",MAX(V$12:OFFSET(V77,-1,0))+1)","v":""},{"$f":"IF(AND($J77=\"Serviço\",$M77<>\"\"),IF($L77=\"\",$M77,CONCATENATE($L77,\"-\",$M77)))","v":"COMPOSIÇÃO-CONSORTE01"},{"$f":"IF(AND(Fonte<>\"\",Código<>\"\"),MATCH(Fonte&\" \"&IF(Fonte=\"sinapi\",SUBSTITUTE(SUBSTITUTE(Código,\"/00\",\"/\"),\"/0\",\"/\"),Código),INDIRECT(\"'[Referência \"&_xlnm.Database&\".xls]Banco'!$a:$a\"),0),\"X\")","v":11},{"$f":"IF(Import.Desoneracao=\"sim\",Referencia.Desonerado,Referencia.NaoDesonerado)","v":78.919999999999987},{"$f":"ROUND(IF(ISNUMBER(R77),R77,IF(LEFT(R77,3)=\"BDI\",HLOOKUP(R77,DADOS!$T$37:$X$38,2,FALSE),0)),15-11*$X$5)","v":0.30209999999999998}]
[{"$f":"CHOOSE(1+LOG(1+2*(J78=\"Meta\")+4*(J78=\"Nível 2\")+8*(J78=\"Nível 3\")+16*(J78=\"Nível 4\")+32*(J78=\"Serviço\"),2),0,1,2,3,4,\"S\")","v":"S"},{"$f":"IF(OR(A78=\"S\",A78=0),0,IF(ISERROR(I78),H78,SMALL(H78:I78,1)))","v":0},{"$f":"IF($A78=1,OFFSET(C78,-1,0)+1,OFFSET(C78,-1,0))","v":1},{"$f":"IF($A78=1,0,IF($A78=2,OFFSET(D78,-1,0)+1,OFFSET(D78,-1,0)))","v":6},{"$f":"IF(AND($A78<=2,$A78<>0),0,IF($A78=3,OFFSET(E78,-1,0)+1,OFFSET(E78,-1,0)))","v":0},{"$f":"IF(AND($A78<=3,$A78<>0),0,IF($A78=4,OFFSET(F78,-1,0)+1,OFFSET(F78,-1,0)))","v":0},{"$f":"IF(AND($A78<=4,$A78<>0),0,IF($A78=\"S\",OFFSET(G78,-1,0)+1,OFFSET(G78,-1,0)))","v":11},0,0,"Serviço",{"$f":"IF($A78=0,\"-\",CONCATENATE(C78&\".\",IF(AND($A$5>=2,$A78>=2),D78&\".\",\"\"),IF(AND($A$5>=3,$A78>=3),E78&\".\",\"\"),IF(AND($A$5>=4,$A78>=4),F78&\".\",\"\"),IF($A78=\"S\",G78&\".\",\"\")))","v":"1.6.0.0.11."},"COMPOSIÇÃO","CONSORTE03","REQUADRO DE ABERTURA PARA PELE DE VIDRO","M",{"$f":"OFFSET(PLQ!$E$12,ROW($P78)-ROW(P$12),0)","v":21.5},30.31,"BDI 1",39.47,848.61,{"$f":"IF($J78=\"\",\"\",IF($N78=\"\",\"DESCRIÇÃO\",IF(AND($J78=\"Serviço\",$O78=\"\"),\"UNIDADE\",IF($T78<=0,\"SEM VALOR\",IF(AND($Y78<>\"\",$Q78>$Y78),\"ACIMA REF.\",\"\")))))","v":""},{"$f":"IF(OR($A78=0,$A78=\"S\",$A78>CFF!$A$9),\"\",MAX(V$12:OFFSET(V78,-1,0))+1)","v":""},{"$f":"IF(AND($J78=\"Serviço\",$M78<>\"\"),IF($L78=\"\",$M78,CONCATENATE($L78,\"-\",$M78)))","v":"COMPOSIÇÃO-CONSORTE03"},14,{"$f":"IF(Import.Desoneracao=\"sim\",Referencia.Desonerado,Referencia.NaoDesonerado)","v":30.310000000000002},{"$f":"ROUND(IF(ISNUMBER(R78),R78,IF(LEFT(R78,3)=\"BDI\",HLOOKUP(R78,DADOS!$T$37:$X$38,2,FALSE),0)),15-11*$X$5)","v":0.30209999999999998}]
[{"$f":"CHOOSE(1+LOG(1+2*(J79=\"Meta\")+4*(J79=\"Nível 2\")+8*(J79=\"Nível 3\")+16*(J79=\"Nível 4\")+32*(J79=\"Serviço\"),2),0,1,2,3,4,\"S\")","v":2},{"$f":"IF(OR(A79=\"S\",A79=0),0,IF(ISERROR(I79),H79,SMALL(H79:I79,1)))","v":4},{"$f":"IF($A79=1,OFFSET(C79,-1,0)+1,OFFSET(C79,-1,0))","v":1},{"$f":"IF($A79=1,0,IF($A79=2,OFFSET(D79,-1,0)+1,OFFSET(D79,-1,0)))","v":7},{"$f":"IF(AND($A79<=2,$A79<>0),0,IF($A79=3,OFFSET(E79,-1,0)+1,OFFSET(E79,-1,0)))","v":0},{"$f":"IF(AND($A79<=3,$A79<>0),0,IF($A79=4,OFFSET(F79,-1,0)+1,OFFSET(F79,-1,0)))","v":0},{"$f":"IF(AND($A79<=4,$A79<>0),0,IF($A79=\"S\",OFFSET(G79,-1,0)+1,OFFSET(G79,-1,0)))","v":0},7,4,"Nível 2",{"$f":"IF($A79=0,\"-\",CONCATENATE(C79&\".\",IF(AND($A$5>=2,$A79>=2),D79&\".\",\"\"),IF(AND($A$5>=3,$A79>=3),E79&\".\",\"\"),IF(AND($A$5>=4,$A79>=4),F79&\".\",\"\"),IF($A79=\"S\",G79&\".\",\"\")))","v":"1.7."},null,null,"CALÇADA EXTERNA DA FACHADA LESTE",{"$f":"Referencia.Unidade","v":""},{"$f":"OFFSET(PLQ!$E$12,ROW($P79)-ROW(P$12),0)","v":0},null,"BDI 1",0,2222.0300000000002,{"$f":"IF($J79=\"\",\"\",IF($N79=\"\",\"DESCRIÇÃO\",IF(AND($J79=\"Serviço\",$O79=\"\"),\"UNIDADE\",IF($T79<=0,\"SEM VALOR\",IF(AND($Y79<>\"\",$Q79>$Y79),\"ACIMA REF.\",\"\")))))","v":""},{"$f":"IF(OR($A79=0,$A79=\"S\",$A79>CFF!$A$9),\"\",MAX(V$12:OFFSET(V79,-1,0))+1)","v":8},{"$f":"IF(AND($J79=\"Serviço\",$M79<>\"\"),IF($L79=\"\",$M79,CONCATENATE($L79,\"-\",$M79)))","v":false},"X",{"$f":"IF(Import.Desoneracao=\"sim\",Referencia.Desonerado,Referencia.NaoDesonerado)","v":0},{"$f":"ROUND(IF(ISNUMBER(R79),R79,IF(LEFT(R79,3)=\"BDI\",HLOOKUP(R79,DADOS!$T$37:$X$38,2,FALSE),0)),15-11*$X$5)","v":0.30209999999999998}]
[{"$f":"CHOOSE(1+LOG(1+2*(J80=\"Meta\")+4*(J80=\"Nível 2\")+8*(J80=\"Nível 3\")+16*(J80=\"Nível 4\")+32*(J80=\"Serviço\"),2),0,1,2,3,4,\"S\")","v":"S"},{"$f":"IF(OR(A80=\"S\",A80=0),0,IF(ISERROR(I80),H80,SMALL(H80:I80,1)))","v":0},{"$f":"IF($A80=1,OFFSET(C80,-1,0)+1,OFFSET(C80,-1,0))","v":1},{"$f":"IF($A80=1,0,IF($A80=2,OFFSET(D80,-1,0)+1,OFFSET(D80,-1,0)))","v":7},{"$f":"IF(AND($A80<=2,$A80<>0),0,IF($A80=3,OFFSET(E80,-1,0)+1,OFFSET(E80,-1,0)))","v":0},{"$f":"IF(AND($A80<=3,$A80<>0),0,IF($A80=4,OFFSET(F80,-1,0)+1,OFFSET(F80,-1,0)))","v":0},{"$f":"IF(AND($A80<=4,$A80<>0),0,IF($A80=\"S\",OFFSET(G80,-1,0)+1,OFFSET(G80,-1,0)))","v":1},0,0,"Serviço",{"$f":"IF($A80=0,\"-\",CONCATENATE(C80&\".\",IF(AND($A$5>=2,$A80>=2),D80&\".\",\"\"),IF(AND($A$5>=3,$A80>=3),E80&\".\",\"\"),IF(AND($A$5>=4,$A80>=4),F80&\".\",\"\"),IF($A80=\"S\",G80&\".\",\"\")))","v":"1.7.0.0.1."},"SINAPI","99814","LIMPEZA DE SUPERFÍCIE COM JATO DE ALTA PRESSÃO. AF_04/2019","M2",{"$f":"OFFSET(PLQ!$E$12,ROW($P80)-ROW(P$12),0)","v":15.53},2.06,"BDI 1",2.68,41.62,{"$f":"IF($J80=\"\",\"\",IF($N80=\"\",\"DESCRIÇÃO\",IF(AND($J80=\"Serviço\",$O80=\"\"),\"UNIDADE\",IF($T80<=0,\"SEM VALOR\",IF(AND($Y80<>\"\",$Q80>$Y80),\"ACIMA REF.\",\"\")))))","v":""},{"$f":"IF(OR($A80=0,$A80=\"S\",$A80>CFF!$A$9),\"\",MAX(V$12:OFFSET(V80,-1,0))+1)","v":""},{"$f":"IF(AND($J80=\"Serviço\",$M80<>\"\"),IF($L80=\"\",$M80,CONCATENATE($L80,\"-\",$M80)))","v":"SINAPI-99814"},12794,{"$f":"IF(Import.Desoneracao=\"sim\",Referencia.Desonerado,Referencia.NaoDesonerado)","v":2.06},{"$f":"ROUND(IF(ISNUMBER(R80),R80,IF(LEFT(R80,3)=\"BDI\",HLOOKUP(R80,DADOS!$T$37:$X$38,2,FALSE),0)),15-11*$X$5)","v":0.30209999999999998}]
["S",0,1,7,0,0,2,0,0,"Serviço","1.7.0.0.2.","SINAPI","98562","IMPERMEABILIZAÇÃO DE SUPERFÍCIE COM ARGAMASSA DE CIMENTO E AREIA, COM ADITIVO IMPERMEABILIZANTE, E = 1,5CM. AF_09/2023","M2",{"$f":"OFFSET(PLQ!$E$12,ROW($P81)-ROW(P$12),0)","v":15.53},50.7,"BDI 1",66.02,1025.29,"",{"$f":"IF(OR($A81=0,$A81=\"S\",$A81>CFF!$A$9),\"\",MAX(V$12:OFFSET(V81,-1,0))+1)","v":""},"SINAPI-98562",10336,{"$f":"IF(Import.Desoneracao=\"sim\",Referencia.Desonerado,Referencia.NaoDesonerado)","v":50.7},{"$f":"ROUND(IF(ISNUMBER(R81),R81,IF(LEFT(R81,3)=\"BDI\",HLOOKUP(R81,DADOS!$T$37:$X$38,2,FALSE),0)),15-11*$X$5)","v":0.30209999999999998}]
["S",0,1,7,0,0,3,0,0,"Serviço","1.7.0.0.3.","SINAPI","98556","IMPERMEABILIZAÇÃO DE SUPERFÍCIE COM ARGAMASSA POLIMÉRICA / MEMBRANA ACRÍLICA, 4 DEMÃOS, REFORÇADA COM VÉU DE POLIÉSTER (MAV). AF_09/2023","M2",{"$f":"OFFSET(PLQ!$E$12,ROW($P82)-ROW(P$12),0)","v":15.53},57.12,"BDI 1",74.38,1155.1199999999999,"",{"$f":"IF(OR($A82=0,$A82=\"S\",$A82>CFF!$A$9),\"\",MAX(V$12:OFFSET(V82,-1,0))+1)","v":""},"SINAPI-98556",10338,{"$f":"IF(Import.Desoneracao=\"sim\",Referencia.Desonerado,Referencia.NaoDesonerado)","v":57.12},{"$f":"ROUND(IF(ISNUMBER(R82),R82,IF(LEFT(R82,3)=\"BDI\",HLOOKUP(R82,DADOS!$T$37:$X$38,2,FALSE),0)),15-11*$X$5)","v":0.30209999999999998}]
[2,3,1,8,0,0,0,3,{"$error":"#N/A"},"Nível 2","1.8.",null,null,"SERVIÇOS FINAIS",{"$f":"Referencia.Unidade","v":""},{"$f":"OFFSET(PLQ!$E$12,ROW($P83)-ROW(P$12),0)","v":0},null,"BDI 1",0,203.22,"",{"$f":"IF(OR($A83=0,$A83=\"S\",$A83>CFF!$A$9),\"\",MAX(V$12:OFFSET(V83,-1,0))+1)","v":9},false,"X",{"$f":"IF(Import.Desoneracao=\"sim\",Referencia.Desonerado,Referencia.NaoDesonerado)","v":0},{"$f":"ROUND(IF(ISNUMBER(R83),R83,IF(LEFT(R83,3)=\"BDI\",HLOOKUP(R83,DADOS!$T$37:$X$38,2,FALSE),0)),15-11*$X$5)","v":0.30209999999999998}]
["S",0,1,8,0,0,1,0,0,"Serviço","1.8.0.0.1.","SINAPI","99820","LIMPEZA DE JANELA INTEIRAMENTE DE VIDRO. AF_04/2019","M2",{"$f":"OFFSET(PLQ!$E$12,ROW($P84)-ROW(P$12),0)","v":48.12},2.21,"BDI 1",2.88,138.59,"",{"$f":"IF(OR($A84=0,$A84=\"S\",$A84>CFF!$A$9),\"\",MAX(V$12:OFFSET(V84,-1,0))+1)","v":""},"SINAPI-99820",12775,{"$f":"IF(Import.Desoneracao=\"sim\",Referencia.Desonerado,Referencia.NaoDesonerado)","v":2.21},{"$f":"ROUND(IF(ISNUMBER(R84),R84,IF(LEFT(R84,3)=\"BDI\",HLOOKUP(R84,DADOS!$T$37:$X$38,2,FALSE),0)),15-11*$X$5)","v":0.30209999999999998}]
[{"$f":"CHOOSE(1+LOG(1+2*(J85=\"Meta\")+4*(J85=\"Nível 2\")+8*(J85=\"Nível 3\")+16*(J85=\"Nível 4\")+32*(J85=\"Serviço\"),2),0,1,2,3,4,\"S\")","v":"S"},{"$f":"IF(OR(A85=\"S\",A85=0),0,IF(ISERROR(I85),H85,SMALL(H85:I85,1)))","v":0},{"$f":"IF($A85=1,OFFSET(C85,-1,0)+1,OFFSET(C85,-1,0))","v":1},{"$f":"IF($A85=1,0,IF($A85=2,OFFSET(D85,-1,0)+1,OFFSET(D85,-1,0)))","v":8},{"$f":"IF(AND($A85<=2,$A85<>0),0,IF($A85=3,OFFSET(E85,-1,0)+1,OFFSET(E85,-1,0)))","v":0},{"$f":"IF(AND($A85<=3,$A85<>0),0,IF($A85=4,OFFSET(F85,-1,0)+1,OFFSET(F85,-1,0)))","v":0},{"$f":"IF(AND($A85<=4,$A85<>0),0,IF($A85=\"S\",OFFSET(G85,-1,0)+1,OFFSET(G85,-1,0)))","v":2},0,0,"Serviço",{"$f":"IF($A85=0,\"-\",CONCATENATE(C85&\".\",IF(AND($A$5>=2,$A85>=2),D85&\".\",\"\"),IF(AND($A$5>=3,$A85>=3),E85&\".\",\"\"),IF(AND($A$5>=4,$A85>=4),F85&\".\",\"\"),IF($A85=\"S\",G85&\".\",\"\")))","v":"1.8.0.0.2."},"SINAPI","99803","LIMPEZA DE PISO CERÂMICO OU PORCELANATO COM PANO ÚMIDO. AF_04/2019","M2",{"$f":"OFFSET(PLQ!$E$12,ROW($P85)-ROW(P$12),0)","v":23},2.16,"BDI 1",{"$f":"IF($A85=\"S\",IF($Q$10=\"Preço Unitário (R$)\",PO.CustoUnitario,ROUND(PO.CustoUnitario*(1+$Z85),15-13*$X$6)),0)","v":2.81},{"$f":"IF($A85=\"S\",VTOTAL1,IF($A85=0,0,ROUND(SomaAgrup,15-13*$X$7)))","v":64.63},{"$f":"IF($J85=\"\",\"\",IF($N85=\"\",\"DESCRIÇÃO\",IF(AND($J85=\"Serviço\",$O85=\"\"),\"UNIDADE\",IF($T85<=0,\"SEM VALOR\",IF(AND($Y85<>\"\",$Q85>$Y85),\"ACIMA REF.\",\"\")))))","v":""},{"$f":"IF(OR($A85=0,$A85=\"S\",$A85>CFF!$A$9),\"\",MAX(V$12:OFFSET(V85,-1,0))+1)","v":""},{"$f":"IF(AND($J85=\"Serviço\",$M85<>\"\"),IF($L85=\"\",$M85,CONCATENATE($L85,\"-\",$M85)))","v":"SINAPI-99803"},{"$f":"IF(AND(Fonte<>\"\",Código<>\"\"),MATCH(Fonte&\" \"&IF(Fonte=\"sinapi\",SUBSTITUTE(SUBSTITUTE(Código,\"/00\",\"/\"),\"/0\",\"/\"),Código),INDIRECT(\"'[Referência \"&_xlnm.Database&\".xls]Banco'!$a:$a\"),0),\"X\")","v":12781},{"$f":"IF(Import.Desoneracao=\"sim\",Referencia.Desonerado,Referencia.NaoDesonerado)","v":2.16},{"$f":"ROUND(IF(ISNUMBER(R85),R85,IF(LEFT(R85,3)=\"BDI\",HLOOKUP(R85,DADOS!$T$37:$X$38,2,FALSE),0)),15-11*$X$5)","v":0.30209999999999998}]
[1,51,2,0,0,0,0,59,51,"Meta","2.",null,null,"LOTE 1 - 2ª ETAPA DA REFORMA",{"$f":"Referencia.Unidade","v":""},{"$f":"OFFSET(PLQ!$E$12,ROW($P86)-ROW(P$12),0)","v":0},null,"BDI 1",0,207612.74,"",{"$f":"IF(OR($A86=0,$A86=\"S\",$A86>CFF!$A$9),\"\",MAX(V$12:OFFSET(V86,-1,0))+1)","v":10},false,{"$f":"IF(AND(Fonte<>\"\",Código<>\"\"),MATCH(Fonte&\" \"&IF(Fonte=\"sinapi\",SUBSTITUTE(SUBSTITUTE(Código,\"/00\",\"/\"),\"/0\",\"/\"),Código),INDIRECT(\"'[Referência \"&_xlnm.Database&\".xls]Banco'!$a:$a\"),0),\"X\")","v":"X"},{"$f":"IF(Import.Desoneracao=\"sim\",Referencia.Desonerado,Referencia.NaoDesonerado)","v":0},{"$f":"ROUND(IF(ISNUMBER(R86),R86,IF(LEFT(R86,3)=\"BDI\",HLOOKUP(R86,DADOS!$T$37:$X$38,2,FALSE),0)),15-11*$X$5)","v":0.30209999999999998}]
[2,2,2,1,0,0,0,50,2,"Nível 2","2.1.",null,null,"SERVIÇOS INICIAIS",{"$f":"Referencia.Unidade","v":""},{"$f":"OFFSET(PLQ!$E$12,ROW($P87)-ROW(P$12),0)","v":0},null,"BDI 1",0,6761.2,"",{"$f":"IF(OR($A87=0,$A87=\"S\",$A87>CFF!$A$9),\"\",MAX(V$12:OFFSET(V87,-1,0))+1)","v":11},false,"X",{"$f":"IF(Import.Desoneracao=\"sim\",Referencia.Desonerado,Referencia.NaoDesonerado)","v":0},{"$f":"ROUND(IF(ISNUMBER(R87),R87,IF(LEFT(R87,3)=\"BDI\",HLOOKUP(R87,DADOS!$T$37:$X$38,2,FALSE),0)),15-11*$X$5)","v":0.30209999999999998}]
["S",0,2,1,0,0,1,0,0,"Serviço","2.1.0.0.1.","COMPOSIÇÃO","CONSORTE02","ADMINSTRAÇÃO LOCAL ","MÊS",{"$f":"OFFSET(PLQ!$E$12,ROW($P88)-ROW(P$12),0)","v":2},2596.27,"BDI 1",3380.6,6761.2,"",{"$f":"IF(OR($A88=0,$A88=\"S\",$A88>CFF!$A$9),\"\",MAX(V$12:OFFSET(V88,-1,0))+1)","v":""},"COMPOSIÇÃO-CONSORTE02",13,{"$f":"IF(Import.Desoneracao=\"sim\",Referencia.Desonerado,Referencia.NaoDesonerado)","v":2596.27},{"$f":"ROUND(IF(ISNUMBER(R88),R88,IF(LEFT(R88,3)=\"BDI\",HLOOKUP(R88,DADOS!$T$37:$X$38,2,FALSE),0)),15-11*$X$5)","v":0.30209999999999998}]
[{"$f":"CHOOSE(1+LOG(1+2*(J89=\"Meta\")+4*(J89=\"Nível 2\")+8*(J89=\"Nível 3\")+16*(J89=\"Nível 4\")+32*(J89=\"Serviço\"),2),0,1,2,3,4,\"S\")","v":2},{"$f":"IF(OR(A89=\"S\",A89=0),0,IF(ISERROR(I89),H89,SMALL(H89:I89,1)))","v":5},{"$f":"IF($A89=1,OFFSET(C89,-1,0)+1,OFFSET(C89,-1,0))","v":2},{"$f":"IF($A89=1,0,IF($A89=2,OFFSET(D89,-1,0)+1,OFFSET(D89,-1,0)))","v":2},{"$f":"IF(AND($A89<=2,$A89<>0),0,IF($A89=3,OFFSET(E89,-1,0)+1,OFFSET(E89,-1,0)))","v":0},{"$f":"IF(AND($A89<=3,$A89<>0),0,IF($A89=4,OFFSET(F89,-1,0)+1,OFFSET(F89,-1,0)))","v":0},{"$f":"IF(AND($A89<=4,$A89<>0),0,IF($A89=\"S\",OFFSET(G89,-1,0)+1,OFFSET(G89,-1,0)))","v":0},48,5,"Nível 2",{"$f":"IF($A89=0,\"-\",CONCATENATE(C89&\".\",IF(AND($A$5>=2,$A89>=2),D89&\".\",\"\"),IF(AND($A$5>=3,$A89>=3),E89&\".\",\"\"),IF(AND($A$5>=4,$A89>=4),F89&\".\",\"\"),IF($A89=\"S\",G89&\".\",\"\")))","v":"2.2."},null,null,"ESCADA",{"$f":"Referencia.Unidade","v":""},{"$f":"OFFSET(PLQ!$E$12,ROW($P89)-ROW(P$12),0)","v":0},null,"BDI 1",0,16481.86,{"$f":"IF($J89=\"\",\"\",IF($N89=\"\",\"DESCRIÇÃO\",IF(AND($J89=\"Serviço\",$O89=\"\"),\"UNIDADE\",IF($T89<=0,\"SEM VALOR\",IF(AND($Y89<>\"\",$Q89>$Y89),\"ACIMA REF.\",\"\")))))","v":""},{"$f":"IF(OR($A89=0,$A89=\"S\",$A89>CFF!$A$9),\"\",MAX(V$12:OFFSET(V89,-1,0))+1)","v":12},{"$f":"IF(AND($J89=\"Serviço\",$M89<>\"\"),IF($L89=\"\",$M89,CONCATENATE($L89,\"-\",$M89)))","v":false},"X",{"$f":"IF(Import.Desoneracao=\"sim\",Referencia.Desonerado,Referencia.NaoDesonerado)","v":0},{"$f":"ROUND(IF(ISNUMBER(R89),R89,IF(LEFT(R89,3)=\"BDI\",HLOOKUP(R89,DADOS!$T$37:$X$38,2,FALSE),0)),15-11*$X$5)","v":0.30209999999999998}]
["S",0,2,2,0,0,1,0,0,"Serviço","2.2.0.0.1.","SINAPI","97629","DEMOLIÇÃO DE LAJES, EM CONCRETO ARMADO, DE FORMA MECANIZADA COM MARTELETE, SEM REAPROVEITAMENTO. AF_09/2023","M3",{"$f":"OFFSET(PLQ!$E$12,ROW($P90)-ROW(P$12),0)","v":2.81},110.73,"BDI 1",144.18,405.15,"",{"$f":"IF(OR($A90=0,$A90=\"S\",$A90>CFF!$A$9),\"\",MAX(V$12:OFFSET(V90,-1,0))+1)","v":""},"SINAPI-97629",7867,{"$f":"IF(Import.Desoneracao=\"sim\",Referencia.Desonerado,Referencia.NaoDesonerado)","v":110.73},{"$f":"ROUND(IF(ISNUMBER(R90),R90,IF(LEFT(R90,3)=\"BDI\",HLOOKUP(R90,DADOS!$T$37:$X$38,2,FALSE),0)),15-11*$X$5)","v":0.30209999999999998}]
[{"$f":"CHOOSE(1+LOG(1+2*(J91=\"Meta\")+4*(J91=\"Nível 2\")+8*(J91=\"Nível 3\")+16*(J91=\"Nível 4\")+32*(J91=\"Serviço\"),2),0,1,2,3,4,\"S\")","v":"S"},{"$f":"IF(OR(A91=\"S\",A91=0),0,IF(ISERROR(I91),H91,SMALL(H91:I91,1)))","v":0},{"$f":"IF($A91=1,OFFSET(C91,-1,0)+1,OFFSET(C91,-1,0))","v":2},{"$f":"IF($A91=1,0,IF($A91=2,OFFSET(D91,-1,0)+1,OFFSET(D91,-1,0)))","v":2},{"$f":"IF(AND($A91<=2,$A91<>0),0,IF($A91=3,OFFSET(E91,-1,0)+1,OFFSET(E91,-1,0)))","v":0},{"$f":"IF(AND($A91<=3,$A91<>0),0,IF($A91=4,OFFSET(F91,-1,0)+1,OFFSET(F91,-1,0)))","v":0},{"$f":"IF(AND($A91<=4,$A91<>0),0,IF($A91=\"S\",OFFSET(G91,-1,0)+1,OFFSET(G91,-1,0)))","v":2},0,0,"Serviço",{"$f":"IF($A91=0,\"-\",CONCATENATE(C91&\".\",IF(AND($A$5>=2,$A91>=2),D91&\".\",\"\"),IF(AND($A$5>=3,$A91>=3),E91&\".\",\"\"),IF(AND($A$5>=4,$A91>=4),F91&\".\",\"\"),IF($A91=\"S\",G91&\".\",\"\")))","v":"2.2.0.0.2."},"COMPOSIÇÃO","SINAPI100209ADAPTADA","TRANSPORTE MANUAL DE REVESTIMENTOS ARGAMASSADOS REMOVIDOS COM CARRINHO DE MÃO 45L - INCLUSO CARGA E DESCARGA","M3XKM",{"$f":"OFFSET(PLQ!$E$12,ROW($P91)-ROW(P$12),0)","v":2.81},145.34,"BDI 1",{"$f":"IF($A91=\"S\",IF($Q$10=\"Preço Unitário (R$)\",PO.CustoUnitario,ROUND(PO.CustoUnitario*(1+$Z91),15-13*$X$6)),0)","v":189.25},{"$f":"IF($A91=\"S\",VTOTAL1,IF($A91=0,0,ROUND(SomaAgrup,15-13*$X$7)))","v":531.79},{"$f":"IF($J91=\"\",\"\",IF($N91=\"\",\"DESCRIÇÃO\",IF(AND($J91=\"Serviço\",$O91=\"\"),\"UNIDADE\",IF($T91<=0,\"SEM VALOR\",IF(AND($Y91<>\"\",$Q91>$Y91),\"ACIMA REF.\",\"\")))))","v":""},{"$f":"IF(OR($A91=0,$A91=\"S\",$A91>CFF!$A$9),\"\",MAX(V$12:OFFSET(V91,-1,0))+1)","v":""},{"$f":"IF(AND($J91=\"Serviço\",$M91<>\"\"),IF($L91=\"\",$M91,CONCATENATE($L91,\"-\",$M91)))","v":"COMPOSIÇÃO-SINAPI100209ADAPTADA"},{"$f":"IF(AND(Fonte<>\"\",Código<>\"\"),MATCH(Fonte&\" \"&IF(Fonte=\"sinapi\",SUBSTITUTE(SUBSTITUTE(Código,\"/00\",\"/\"),\"/0\",\"/\"),Código),INDIRECT(\"'[Referência \"&_xlnm.Database&\".xls]Banco'!$a:$a\"),0),\"X\")","v":12},{"$f":"IF(Import.Desoneracao=\"sim\",Referencia.Desonerado,Referencia.NaoDesonerado)","v":145.34},{"$f":"ROUND(IF(ISNUMBER(R91),R91,IF(LEFT(R91,3)=\"BDI\",HLOOKUP(R91,DADOS!$T$37:$X$38,2,FALSE),0)),15-11*$X$5)","v":0.30209999999999998}]
[{"$f":"CHOOSE(1+LOG(1+2*(J92=\"Meta\")+4*(J92=\"Nível 2\")+8*(J92=\"Nível 3\")+16*(J92=\"Nível 4\")+32*(J92=\"Serviço\"),2),0,1,2,3,4,\"S\")","v":"S"},{"$f":"IF(OR(A92=\"S\",A92=0),0,IF(ISERROR(I92),H92,SMALL(H92:I92,1)))","v":0},{"$f":"IF($A92=1,OFFSET(C92,-1,0)+1,OFFSET(C92,-1,0))","v":2},{"$f":"IF($A92=1,0,IF($A92=2,OFFSET(D92,-1,0)+1,OFFSET(D92,-1,0)))","v":2},{"$f":"IF(AND($A92<=2,$A92<>0),0,IF($A92=3,OFFSET(E92,-1,0)+1,OFFSET(E92,-1,0)))","v":0},{"$f":"IF(AND($A92<=3,$A92<>0),0,IF($A92=4,OFFSET(F92,-1,0)+1,OFFSET(F92,-1,0)))","v":0},{"$f":"IF(AND($A92<=4,$A92<>0),0,IF($A92=\"S\",OFFSET(G92,-1,0)+1,OFFSET(G92,-1,0)))","v":3},0,0,"Serviço",{"$f":"IF($A92=0,\"-\",CONCATENATE(C92&\".\",IF(AND($A$5>=2,$A92>=2),D92&\".\",\"\"),IF(AND($A$5>=3,$A92>=3),E92&\".\",\"\"),IF(AND($A$5>=4,$A92>=4),F92&\".\",\"\"),IF($A92=\"S\",G92&\".\",\"\")))","v":"2.2.0.0.3."},"COMPOSIÇÃO","SINAPI102074ADAPTADA","ESCADA EM CONCRETO ARMADO MOLDADO IN LOCO, FCK 25 MPA, APENAS PISANTES, SEM ARMADURA, FÔRMA EM CHAPA DE MADEIRA COMPENSADA RESINADA.","M³",{"$f":"OFFSET(PLQ!$E$12,ROW($P92)-ROW(P$12),0)","v":1.83},3185.06,"BDI 1",{"$f":"IF($A92=\"S\",IF($Q$10=\"Preço Unitário (R$)\",PO.CustoUnitario,ROUND(PO.CustoUnitario*(1+$Z92),15-13*$X$6)),0)","v":4147.2700000000004},{"$f":"IF($A92=\"S\",VTOTAL1,IF($A92=0,0,ROUND(SomaAgrup,15-13*$X$7)))","v":7589.5},{"$f":"IF($J92=\"\",\"\",IF($N92=\"\",\"DESCRIÇÃO\",IF(AND($J92=\"Serviço\",$O92=\"\"),\"UNIDADE\",IF($T92<=0,\"SEM VALOR\",IF(AND($Y92<>\"\",$Q92>$Y92),\"ACIMA REF.\",\"\")))))","v":""},{"$f":"IF(OR($A92=0,$A92=\"S\",$A92>CFF!$A$9),\"\",MAX(V$12:OFFSET(V92,-1,0))+1)","v":""},{"$f":"IF(AND($J92=\"Serviço\",$M92<>\"\"),IF($L92=\"\",$M92,CONCATENATE($L92,\"-\",$M92)))","v":"COMPOSIÇÃO-SINAPI102074ADAPTADA"},{"$f":"IF(AND(Fonte<>\"\",Código<>\"\"),MATCH(Fonte&\" \"&IF(Fonte=\"sinapi\",SUBSTITUTE(SUBSTITUTE(Código,\"/00\",\"/\"),\"/0\",\"/\"),Código),INDIRECT(\"'[Referência \"&_xlnm.Database&\".xls]Banco'!$a:$a\"),0),\"X\")","v":15},{"$f":"IF(Import.Desoneracao=\"sim\",Referencia.Desonerado,Referencia.NaoDesonerado)","v":3185.06},{"$f":"ROUND(IF(ISNUMBER(R92),R92,IF(LEFT(R92,3)=\"BDI\",HLOOKUP(R92,DADOS!$T$37:$X$38,2,FALSE),0)),15-11*$X$5)","v":0.30209999999999998}]
["S",0,2,2,0,0,4,0,0,"Serviço","2.2.0.0.4.","SINAPI","98671","PISO EM GRANITO APLICADO EM AMBIENTES INTERNOS. AF_09/2020","M2",{"$f":"OFFSET(PLQ!$E$12,ROW($P93)-ROW(P$12),0)","v":13.8},442.73,"BDI 1",576.48,7955.42,"",{"$f":"IF(OR($A93=0,$A93=\"S\",$A93>CFF!$A$9),\"\",MAX(V$12:OFFSET(V93,-1,0))+1)","v":""},"SINAPI-98671",14036,{"$f":"IF(Import.Desoneracao=\"sim\",Referencia.Desonerado,Referencia.NaoDesonerado)","v":442.73},{"$f":"ROUND(IF(ISNUMBER(R93),R93,IF(LEFT(R93,3)=\"BDI\",HLOOKUP(R93,DADOS!$T$37:$X$38,2,FALSE),0)),15-11*$X$5)","v":0.30209999999999998}]
[{"$f":"CHOOSE(1+LOG(1+2*(J94=\"Meta\")+4*(J94=\"Nível 2\")+8*(J94=\"Nível 3\")+16*(J94=\"Nível 4\")+32*(J94=\"Serviço\"),2),0,1,2,3,4,\"S\")","v":2},{"$f":"IF(OR(A94=\"S\",A94=0),0,IF(ISERROR(I94),H94,SMALL(H94:I94,1)))","v":13},{"$f":"IF($A94=1,OFFSET(C94,-1,0)+1,OFFSET(C94,-1,0))","v":2},{"$f":"IF($A94=1,0,IF($A94=2,OFFSET(D94,-1,0)+1,OFFSET(D94,-1,0)))","v":3},{"$f":"IF(AND($A94<=2,$A94<>0),0,IF($A94=3,OFFSET(E94,-1,0)+1,OFFSET(E94,-1,0)))","v":0},{"$f":"IF(AND($A94<=3,$A94<>0),0,IF($A94=4,OFFSET(F94,-1,0)+1,OFFSET(F94,-1,0)))","v":0},{"$f":"IF(AND($A94<=4,$A94<>0),0,IF($A94=\"S\",OFFSET(G94,-1,0)+1,OFFSET(G94,-1,0)))","v":0},43,13,"Nível 2",{"$f":"IF($A94=0,\"-\",CONCATENATE(C94&\".\",IF(AND($A$5>=2,$A94>=2),D94&\".\",\"\"),IF(AND($A$5>=3,$A94>=3),E94&\".\",\"\"),IF(AND($A$5>=4,$A94>=4),F94&\".\",\"\"),IF($A94=\"S\",G94&\".\",\"\")))","v":"2.3."},null,null,"INSTALAÇÕES ELÉTRICAS",{"$f":"Referencia.Unidade","v":""},{"$f":"OFFSET(PLQ!$E$12,ROW($P94)-ROW(P$12),0)","v":0},null,"BDI 1",0,5694.26,{"$f":"IF($J94=\"\",\"\",IF($N94=\"\",\"DESCRIÇÃO\",IF(AND($J94=\"Serviço\",$O94=\"\"),\"UNIDADE\",IF($T94<=0,\"SEM VALOR\",IF(AND($Y94<>\"\",$Q94>$Y94),\"ACIMA REF.\",\"\")))))","v":""},{"$f":"IF(OR($A94=0,$A94=\"S\",$A94>CFF!$A$9),\"\",MAX(V$12:OFFSET(V94,-1,0))+1)","v":13},{"$f":"IF(AND($J94=\"Serviço\",$M94<>\"\"),IF($L94=\"\",$M94,CONCATENATE($L94,\"-\",$M94)))","v":false},"X",{"$f":"IF(Import.Desoneracao=\"sim\",Referencia.Desonerado,Referencia.NaoDesonerado)","v":0},{"$f":"ROUND(IF(ISNUMBER(R94),R94,IF(LEFT(R94,3)=\"BDI\",HLOOKUP(R94,DADOS!$T$37:$X$38,2,FALSE),0)),15-11*$X$5)","v":0.30209999999999998}]
[{"$f":"CHOOSE(1+LOG(1+2*(J95=\"Meta\")+4*(J95=\"Nível 2\")+8*(J95=\"Nível 3\")+16*(J95=\"Nível 4\")+32*(J95=\"Serviço\"),2),0,1,2,3,4,\"S\")","v":"S"},{"$f":"IF(OR(A95=\"S\",A95=0),0,IF(ISERROR(I95),H95,SMALL(H95:I95,1)))","v":0},{"$f":"IF($A95=1,OFFSET(C95,-1,0)+1,OFFSET(C95,-1,0))","v":2},{"$f":"IF($A95=1,0,IF($A95=2,OFFSET(D95,-1,0)+1,OFFSET(D95,-1,0)))","v":3},{"$f":"IF(AND($A95<=2,$A95<>0),0,IF($A95=3,OFFSET(E95,-1,0)+1,OFFSET(E95,-1,0)))","v":0},{"$f":"IF(AND($A95<=3,$A95<>0),0,IF($A95=4,OFFSET(F95,-1,0)+1,OFFSET(F95,-1,0)))","v":0},{"$f":"IF(AND($A95<=4,$A95<>0),0,IF($A95=\"S\",OFFSET(G95,-1,0)+1,OFFSET(G95,-1,0)))","v":1},0,0,"Serviço",{"$f":"IF($A95=0,\"-\",CONCATENATE(C95&\".\",IF(AND($A$5>=2,$A95>=2),D95&\".\",\"\"),IF(AND($A$5>=3,$A95>=3),E95&\".\",\"\"),IF(AND($A$5>=4,$A95>=4),F95&\".\",\"\"),IF($A95=\"S\",G95&\".\",\"\")))","v":"2.3.0.0.1."},"COTAÇÃO","RCV05","LUMINÁRIA LED PLAFON EMBUTIR 24W - FORNECIMENTO E INSTALAÇÃO","UN ",{"$f":"OFFSET(PLQ!$E$12,ROW($P95)-ROW(P$12),0)","v":44},{"$f":"Y95/1.3021","v":0},"BDI 1",0,0,{"$f":"IF($J95=\"\",\"\",IF($N95=\"\",\"DESCRIÇÃO\",IF(AND($J95=\"Serviço\",$O95=\"\"),\"UNIDADE\",IF($T95<=0,\"SEM VALOR\",IF(AND($Y95<>\"\",$Q95>$Y95),\"ACIMA REF.\",\"\")))))","v":"SEM VALOR"},{"$f":"IF(OR($A95=0,$A95=\"S\",$A95>CFF!$A$9),\"\",MAX(V$12:OFFSET(V95,-1,0))+1)","v":""},{"$f":"IF(AND($J95=\"Serviço\",$M95<>\"\"),IF($L95=\"\",$M95,CONCATENATE($L95,\"-\",$M95)))","v":"COTAÇÃO-RCV05"},21,{"$f":"IF(Import.Desoneracao=\"sim\",Referencia.Desonerado,Referencia.NaoDesonerado)","v":0},{"$f":"ROUND(IF(ISNUMBER(R95),R95,IF(LEFT(R95,3)=\"BDI\",HLOOKUP(R95,DADOS!$T$37:$X$38,2,FALSE),0)),15-11*$X$5)","v":0.30209999999999998}]
["S",0,2,3,0,0,2,0,0,"Serviço","2.3.0.0.2.","SINAPI","91845","ELETRODUTO FLEXÍVEL CORRUGADO REFORÇADO, PVC, DN 25 MM (3/4\"), PARA CIRCUITOS TERMINAIS, INSTALADO EM LAJE - FORNECIMENTO E INSTALAÇÃO. AF_03/2023","M",{"$f":"OFFSET(PLQ!$E$12,ROW($P96)-ROW(P$12),0)","v":70},9.65,"BDI 1",12.57,879.9,"",{"$f":"IF(OR($A96=0,$A96=\"S\",$A96>CFF!$A$9),\"\",MAX(V$12:OFFSET(V96,-1,0))+1)","v":""},"SINAPI-91845",10433,{"$f":"IF(Import.Desoneracao=\"sim\",Referencia.Desonerado,Referencia.NaoDesonerado)","v":9.65},{"$f":"ROUND(IF(ISNUMBER(R96),R96,IF(LEFT(R96,3)=\"BDI\",HLOOKUP(R96,DADOS!$T$37:$X$38,2,FALSE),0)),15-11*$X$5)","v":0.30209999999999998}]
[{"$f":"CHOOSE(1+LOG(1+2*(J97=\"Meta\")+4*(J97=\"Nível 2\")+8*(J97=\"Nível 3\")+16*(J97=\"Nível 4\")+32*(J97=\"Serviço\"),2),0,1,2,3,4,\"S\")","v":"S"},{"$f":"IF(OR(A97=\"S\",A97=0),0,IF(ISERROR(I97),H97,SMALL(H97:I97,1)))","v":0},{"$f":"IF($A97=1,OFFSET(C97,-1,0)+1,OFFSET(C97,-1,0))","v":2},{"$f":"IF($A97=1,0,IF($A97=2,OFFSET(D97,-1,0)+1,OFFSET(D97,-1,0)))","v":3},{"$f":"IF(AND($A97<=2,$A97<>0),0,IF($A97=3,OFFSET(E97,-1,0)+1,OFFSET(E97,-1,0)))","v":0},{"$f":"IF(AND($A97<=3,$A97<>0),0,IF($A97=4,OFFSET(F97,-1,0)+1,OFFSET(F97,-1,0)))","v":0},{"$f":"IF(AND($A97<=4,$A97<>0),0,IF($A97=\"S\",OFFSET(G97,-1,0)+1,OFFSET(G97,-1,0)))","v":3},0,0,"Serviço",{"$f":"IF($A97=0,\"-\",CONCATENATE(C97&\".\",IF(AND($A$5>=2,$A97>=2),D97&\".\",\"\"),IF(AND($A$5>=3,$A97>=3),E97&\".\",\"\"),IF(AND($A$5>=4,$A97>=4),F97&\".\",\"\"),IF($A97=\"S\",G97&\".\",\"\")))","v":"2.3.0.0.3."},"SINAPI","95728","ELETRODUTO RÍGIDO SOLDÁVEL, PVC, DN 32 MM (1\"), APARENTE - FORNECIMENTO E INSTALAÇÃO. AF_10/2022","M",{"$f":"OFFSET(PLQ!$E$12,ROW($P97)-ROW(P$12),0)","v":7},27.97,"BDI 1",{"$f":"IF($A97=\"S\",IF($Q$10=\"Preço Unitário (R$)\",PO.CustoUnitario,ROUND(PO.CustoUnitario*(1+$Z97),15-13*$X$6)),0)","v":36.42},{"$f":"IF($A97=\"S\",VTOTAL1,IF($A97=0,0,ROUND(SomaAgrup,15-13*$X$7)))","v":254.94},{"$f":"IF($J97=\"\",\"\",IF($N97=\"\",\"DESCRIÇÃO\",IF(AND($J97=\"Serviço\",$O97=\"\"),\"UNIDADE\",IF($T97<=0,\"SEM VALOR\",IF(AND($Y97<>\"\",$Q97>$Y97),\"ACIMA REF.\",\"\")))))","v":""},{"$f":"IF(OR($A97=0,$A97=\"S\",$A97>CFF!$A$9),\"\",MAX(V$12:OFFSET(V97,-1,0))+1)","v":""},{"$f":"IF(AND($J97=\"Serviço\",$M97<>\"\"),IF($L97=\"\",$M97,CONCATENATE($L97,\"-\",$M97)))","v":"SINAPI-95728"},{"$f":"IF(AND(Fonte<>\"\",Código<>\"\"),MATCH(Fonte&\" \"&IF(Fonte=\"sinapi\",SUBSTITUTE(SUBSTITUTE(Código,\"/00\",\"/\"),\"/0\",\"/\"),Código),INDIRECT(\"'[Referência \"&_xlnm.Database&\".xls]Banco'!$a:$a\"),0),\"X\")","v":10640},{"$f":"IF(Import.Desoneracao=\"sim\",Referencia.Desonerado,Referencia.NaoDesonerado)","v":27.97},{"$f":"ROUND(IF(ISNUMBER(R97),R97,IF(LEFT(R97,3)=\"BDI\",HLOOKUP(R97,DADOS!$T$37:$X$38,2,FALSE),0)),15-11*$X$5)","v":0.30209999999999998}]
["S",0,2,3,0,0,4,0,0,"Serviço","2.3.0.0.4.","SINAPI","91927","CABO DE COBRE FLEXÍVEL ISOLADO, 2,5 MM², ANTI-CHAMA 0,6/1,0 KV, PARA CIRCUITOS TERMINAIS - FORNECIMENTO E INSTALAÇÃO. AF_03/2023","M",{"$f":"OFFSET(PLQ!$E$12,ROW($P98)-ROW(P$12),0)","v":140},5,"BDI 1",6.51,911.4,"",{"$f":"IF(OR($A98=0,$A98=\"S\",$A98>CFF!$A$9),\"\",MAX(V$12:OFFSET(V98,-1,0))+1)","v":""},"SINAPI-91927",10370,{"$f":"IF(Import.Desoneracao=\"sim\",Referencia.Desonerado,Referencia.NaoDesonerado)","v":5},{"$f":"ROUND(IF(ISNUMBER(R98),R98,IF(LEFT(R98,3)=\"BDI\",HLOOKUP(R98,DADOS!$T$37:$X$38,2,FALSE),0)),15-11*$X$5)","v":0.30209999999999998}]
["S",0,2,3,0,0,5,0,0,"Serviço","2.3.0.0.5.","SINAPI","92000","TOMADA BAIXA DE EMBUTIR (1 MÓDULO), 2P+T 10 A, INCLUINDO SUPORTE E PLACA - FORNECIMENTO E INSTALAÇÃO. AF_03/2023","UN",{"$f":"OFFSET(PLQ!$E$12,ROW($P99)-ROW(P$12),0)","v":30},34.340000000000003,"BDI 1",44.71,1341.3,"",{"$f":"IF(OR($A99=0,$A99=\"S\",$A99>CFF!$A$9),\"\",MAX(V$12:OFFSET(V99,-1,0))+1)","v":""},"SINAPI-92000",10538,{"$f":"IF(Import.Desoneracao=\"sim\",Referencia.Desonerado,Referencia.NaoDesonerado)","v":34.340000000000003},{"$f":"ROUND(IF(ISNUMBER(R99),R99,IF(LEFT(R99,3)=\"BDI\",HLOOKUP(R99,DADOS!$T$37:$X$38,2,FALSE),0)),15-11*$X$5)","v":0.30209999999999998}]
[{"$f":"CHOOSE(1+LOG(1+2*(J100=\"Meta\")+4*(J100=\"Nível 2\")+8*(J100=\"Nível 3\")+16*(J100=\"Nível 4\")+32*(J100=\"Serviço\"),2),0,1,2,3,4,\"S\")","v":"S"},{"$f":"IF(OR(A100=\"S\",A100=0),0,IF(ISERROR(I100),H100,SMALL(H100:I100,1)))","v":0},{"$f":"IF($A100=1,OFFSET(C100,-1,0)+1,OFFSET(C100,-1,0))","v":2},{"$f":"IF($A100=1,0,IF($A100=2,OFFSET(D100,-1,0)+1,OFFSET(D100,-1,0)))","v":3},{"$f":"IF(AND($A100<=2,$A100<>0),0,IF($A100=3,OFFSET(E100,-1,0)+1,OFFSET(E100,-1,0)))","v":0},{"$f":"IF(AND($A100<=3,$A100<>0),0,IF($A100=4,OFFSET(F100,-1,0)+1,OFFSET(F100,-1,0)))","v":0},{"$f":"IF(AND($A100<=4,$A100<>0),0,IF($A100=\"S\",OFFSET(G100,-1,0)+1,OFFSET(G100,-1,0)))","v":6},0,0,"Serviço",{"$f":"IF($A100=0,\"-\",CONCATENATE(C100&\".\",IF(AND($A$5>=2,$A100>=2),D100&\".\",\"\"),IF(AND($A$5>=3,$A100>=3),E100&\".\",\"\"),IF(AND($A$5>=4,$A100>=4),F100&\".\",\"\"),IF($A100=\"S\",G100&\".\",\"\")))","v":"2.3.0.0.6."},"SINAPI","91993","TOMADA ALTA DE EMBUTIR (1 MÓDULO), 2P+T 20 A, INCLUINDO SUPORTE E PLACA - FORNECIMENTO E INSTALAÇÃO. AF_03/2023","UN",{"$f":"OFFSET(PLQ!$E$12,ROW($P100)-ROW(P$12),0)","v":5},51.19,"BDI 1",{"$f":"IF($A100=\"S\",IF($Q$10=\"Preço Unitário (R$)\",PO.CustoUnitario,ROUND(PO.CustoUnitario*(1+$Z100),15-13*$X$6)),0)","v":66.650000000000006},{"$f":"IF($A100=\"S\",VTOTAL1,IF($A100=0,0,ROUND(SomaAgrup,15-13*$X$7)))","v":333.25},{"$f":"IF($J100=\"\",\"\",IF($N100=\"\",\"DESCRIÇÃO\",IF(AND($J100=\"Serviço\",$O100=\"\"),\"UNIDADE\",IF($T100<=0,\"SEM VALOR\",IF(AND($Y100<>\"\",$Q100>$Y100),\"ACIMA REF.\",\"\")))))","v":""},{"$f":"IF(OR($A100=0,$A100=\"S\",$A100>CFF!$A$9),\"\",MAX(V$12:OFFSET(V100,-1,0))+1)","v":""},{"$f":"IF(AND($J100=\"Serviço\",$M100<>\"\"),IF($L100=\"\",$M100,CONCATENATE($L100,\"-\",$M100)))","v":"SINAPI-91993"},{"$f":"IF(AND(Fonte<>\"\",Código<>\"\"),MATCH(Fonte&\" \"&IF(Fonte=\"sinapi\",SUBSTITUTE(SUBSTITUTE(Código,\"/00\",\"/\"),\"/0\",\"/\"),Código),INDIRECT(\"'[Referência \"&_xlnm.Database&\".xls]Banco'!$a:$a\"),0),\"X\")","v":10536},{"$f":"IF(Import.Desoneracao=\"sim\",Referencia.Desonerado,Referencia.NaoDesonerado)","v":51.19},{"$f":"ROUND(IF(ISNUMBER(R100),R100,IF(LEFT(R100,3)=\"BDI\",HLOOKUP(R100,DADOS!$T$37:$X$38,2,FALSE),0)),15-11*$X$5)","v":0.30209999999999998}]
["S",0,2,3,0,0,7,{"$f":"IF(OR($A101=\"S\",$A101=0),0,MATCH(0,OFFSET($B101,1,$A101,ROW($A$145)-ROW($A101)),0))","v":0},{"$f":"IF(OR($A101=\"S\",$A101=0),0,MATCH(OFFSET($B101,0,$A101)+1,OFFSET($B101,1,$A101,ROW($A$145)-ROW($A101)),0))","v":0},"Serviço","2.3.0.0.7.","SINAPI","91953","INTERRUPTOR SIMPLES (1 MÓDULO), 10A/250V, INCLUINDO SUPORTE E PLACA - FORNECIMENTO E INSTALAÇÃO. AF_03/2023","UN",{"$f":"OFFSET(PLQ!$E$12,ROW($P101)-ROW(P$12),0)","v":10},32.67,"BDI 1",42.54,425.4,"",{"$f":"IF(OR($A101=0,$A101=\"S\",$A101>CFF!$A$9),\"\",MAX(V$12:OFFSET(V101,-1,0))+1)","v":""},"SINAPI-91953",10496,{"$f":"IF(Import.Desoneracao=\"sim\",Referencia.Desonerado,Referencia.NaoDesonerado)","v":32.67},{"$f":"ROUND(IF(ISNUMBER(R101),R101,IF(LEFT(R101,3)=\"BDI\",HLOOKUP(R101,DADOS!$T$37:$X$38,2,FALSE),0)),15-11*$X$5)","v":0.30209999999999998}]
["S",0,2,3,0,0,8,0,0,"Serviço","2.3.0.0.8.","SINAPI","91967","INTERRUPTOR SIMPLES (3 MÓDULOS), 10A/250V, INCLUINDO SUPORTE E PLACA - FORNECIMENTO E INSTALAÇÃO. AF_03/2023","UN",{"$f":"OFFSET(PLQ!$E$12,ROW($P102)-ROW(P$12),0)","v":5},67.260000000000005,"BDI 1",87.58,437.9,"",{"$f":"IF(OR($A102=0,$A102=\"S\",$A102>CFF!$A$9),\"\",MAX(V$12:OFFSET(V102,-1,0))+1)","v":""},"SINAPI-91967",10510,{"$f":"IF(Import.Desoneracao=\"sim\",Referencia.Desonerado,Referencia.NaoDesonerado)","v":67.260000000000005},{"$f":"ROUND(IF(ISNUMBER(R102),R102,IF(LEFT(R102,3)=\"BDI\",HLOOKUP(R102,DADOS!$T$37:$X$38,2,FALSE),0)),15-11*$X$5)","v":0.30209999999999998}]
["S",0,2,3,0,0,9,0,0,"Serviço","2.3.0.0.9.","SINAPI","91947","SUPORTE PARAFUSADO COM PLACA DE ENCAIXE 4\" X 2\" BAIXO (0,30 M DO PISO) PARA PONTO ELÉTRICO - FORNECIMENTO E INSTALAÇÃO. AF_03/2023","UN",{"$f":"OFFSET(PLQ!$E$12,ROW($P103)-ROW(P$12),0)","v":5},10.15,"BDI 1",13.22,66.099999999999994,"",{"$f":"IF(OR($A103=0,$A103=\"S\",$A103>CFF!$A$9),\"\",MAX(V$12:OFFSET(V103,-1,0))+1)","v":""},"SINAPI-91947",10529,{"$f":"IF(Import.Desoneracao=\"sim\",Referencia.Desonerado,Referencia.NaoDesonerado)","v":10.15},{"$f":"ROUND(IF(ISNUMBER(R103),R103,IF(LEFT(R103,3)=\"BDI\",HLOOKUP(R103,DADOS!$T$37:$X$38,2,FALSE),0)),15-11*$X$5)","v":0.30209999999999998}]
["S",0,2,3,0,0,10,0,0,"Serviço","2.3.0.0.10.","SINAPI","98111","CAIXA DE INSPEÇÃO PARA ATERRAMENTO, CIRCULAR, EM POLIETILENO, DIÂMETRO INTERNO = 0,3 M. AF_12/2020","UN",{"$f":"OFFSET(PLQ!$E$12,ROW($P104)-ROW(P$12),0)","v":1},52.52,"BDI 1",68.39,68.39,"",{"$f":"IF(OR($A104=0,$A104=\"S\",$A104>CFF!$A$9),\"\",MAX(V$12:OFFSET(V104,-1,0))+1)","v":""},"SINAPI-98111",7116,{"$f":"IF(Import.Desoneracao=\"sim\",Referencia.Desonerado,Referencia.NaoDesonerado)","v":52.52},{"$f":"ROUND(IF(ISNUMBER(R104),R104,IF(LEFT(R104,3)=\"BDI\",HLOOKUP(R104,DADOS!$T$37:$X$38,2,FALSE),0)),15-11*$X$5)","v":0.30209999999999998}]
["S",0,2,3,0,0,11,0,0,"Serviço","2.3.0.0.11.","SINAPI-I","39456","DISPOSITIVO DR, 4 POLOS, SENSIBILIDADE DE 30 MA, CORRENTE DE 40 A, TIPO AC","UN",{"$f":"OFFSET(PLQ!$E$12,ROW($P105)-ROW(P$12),0)","v":2},144.63,"BDI 1",188.32,376.64,"",{"$f":"IF(OR($A105=0,$A105=\"S\",$A105>CFF!$A$9),\"\",MAX(V$12:OFFSET(V105,-1,0))+1)","v":""},"SINAPI-I-39456",1828,{"$f":"IF(Import.Desoneracao=\"sim\",Referencia.Desonerado,Referencia.NaoDesonerado)","v":144.63},{"$f":"ROUND(IF(ISNUMBER(R105),R105,IF(LEFT(R105,3)=\"BDI\",HLOOKUP(R105,DADOS!$T$37:$X$38,2,FALSE),0)),15-11*$X$5)","v":0.30209999999999998}]
["S",0,2,3,0,0,12,0,0,"Serviço","2.3.0.0.12.","SINAPI","88264","ELETRICISTA COM ENCARGOS COMPLEMENTARES","H",{"$f":"OFFSET(PLQ!$E$12,ROW($P106)-ROW(P$12),0)","v":16},28.75,"BDI 1",37.44,599.04,"",{"$f":"IF(OR($A106=0,$A106=\"S\",$A106>CFF!$A$9),\"\",MAX(V$12:OFFSET(V106,-1,0))+1)","v":""},"SINAPI-88264",13046,{"$f":"IF(Import.Desoneracao=\"sim\",Referencia.Desonerado,Referencia.NaoDesonerado)","v":28.75},{"$f":"ROUND(IF(ISNUMBER(R106),R106,IF(LEFT(R106,3)=\"BDI\",HLOOKUP(R106,DADOS!$T$37:$X$38,2,FALSE),0)),15-11*$X$5)","v":0.30209999999999998}]
[2,8,2,4,0,0,0,30,8,"Nível 2","2.4.",null,null,"FORRO",{"$f":"Referencia.Unidade","v":""},{"$f":"OFFSET(PLQ!$E$12,ROW($P107)-ROW(P$12),0)","v":0},null,"BDI 1",0,44715.96,"",{"$f":"IF(OR($A107=0,$A107=\"S\",$A107>CFF!$A$9),\"\",MAX(V$12:OFFSET(V107,-1,0))+1)","v":14},false,"X",0,{"$f":"ROUND(IF(ISNUMBER(R107),R107,IF(LEFT(R107,3)=\"BDI\",HLOOKUP(R107,DADOS!$T$37:$X$38,2,FALSE),0)),15-11*$X$5)","v":0.30209999999999998}]
[{"$f":"CHOOSE(1+LOG(1+2*(J108=\"Meta\")+4*(J108=\"Nível 2\")+8*(J108=\"Nível 3\")+16*(J108=\"Nível 4\")+32*(J108=\"Serviço\"),2),0,1,2,3,4,\"S\")","v":"S"},{"$f":"IF(OR(A108=\"S\",A108=0),0,IF(ISERROR(I108),H108,SMALL(H108:I108,1)))","v":0},{"$f":"IF($A108=1,OFFSET(C108,-1,0)+1,OFFSET(C108,-1,0))","v":2},{"$f":"IF($A108=1,0,IF($A108=2,OFFSET(D108,-1,0)+1,OFFSET(D108,-1,0)))","v":4},{"$f":"IF(AND($A108<=2,$A108<>0),0,IF($A108=3,OFFSET(E108,-1,0)+1,OFFSET(E108,-1,0)))","v":0},{"$f":"IF(AND($A108<=3,$A108<>0),0,IF($A108=4,OFFSET(F108,-1,0)+1,OFFSET(F108,-1,0)))","v":0},{"$f":"IF(AND($A108<=4,$A108<>0),0,IF($A108=\"S\",OFFSET(G108,-1,0)+1,OFFSET(G108,-1,0)))","v":1},0,0,"Serviço",{"$f":"IF($A108=0,\"-\",CONCATENATE(C108&\".\",IF(AND($A$5>=2,$A108>=2),D108&\".\",\"\"),IF(AND($A$5>=3,$A108>=3),E108&\".\",\"\"),IF(AND($A$5>=4,$A108>=4),F108&\".\",\"\"),IF($A108=\"S\",G108&\".\",\"\")))","v":"2.4.0.0.1."},"SINAPI","97665","REMOÇÃO DE LUMINÁRIAS, DE FORMA MANUAL, SEM REAPROVEITAMENTO. AF_09/2023","UN",{"$f":"OFFSET(PLQ!$E$12,ROW($P108)-ROW(P$12),0)","v":28},1.87,"BDI 1",{"$f":"IF($A108=\"S\",IF($Q$10=\"Preço Unitário (R$)\",PO.CustoUnitario,ROUND(PO.CustoUnitario*(1+$Z108),15-13*$X$6)),0)","v":2.4300000000000002},{"$f":"IF($A108=\"S\",VTOTAL1,IF($A108=0,0,ROUND(SomaAgrup,15-13*$X$7)))","v":68.040000000000006},{"$f":"IF($J108=\"\",\"\",IF($N108=\"\",\"DESCRIÇÃO\",IF(AND($J108=\"Serviço\",$O108=\"\"),\"UNIDADE\",IF($T108<=0,\"SEM VALOR\",IF(AND($Y108<>\"\",$Q108>$Y108),\"ACIMA REF.\",\"\")))))","v":""},{"$f":"IF(OR($A108=0,$A108=\"S\",$A108>CFF!$A$9),\"\",MAX(V$12:OFFSET(V108,-1,0))+1)","v":""},{"$f":"IF(AND($J108=\"Serviço\",$M108<>\"\"),IF($L108=\"\",$M108,CONCATENATE($L108,\"-\",$M108)))","v":"SINAPI-97665"},{"$f":"IF(AND(Fonte<>\"\",Código<>\"\"),MATCH(Fonte&\" \"&IF(Fonte=\"sinapi\",SUBSTITUTE(SUBSTITUTE(Código,\"/00\",\"/\"),\"/0\",\"/\"),Código),INDIRECT(\"'[Referência \"&_xlnm.Database&\".xls]Banco'!$a:$a\"),0),\"X\")","v":7892},{"$f":"IF(Import.Desoneracao=\"sim\",Referencia.Desonerado,Referencia.NaoDesonerado)","v":1.87},{"$f":"ROUND(IF(ISNUMBER(R108),R108,IF(LEFT(R108,3)=\"BDI\",HLOOKUP(R108,DADOS!$T$37:$X$38,2,FALSE),0)),15-11*$X$5)","v":0.30209999999999998}]
[{"$f":"CHOOSE(1+LOG(1+2*(J109=\"Meta\")+4*(J109=\"Nível 2\")+8*(J109=\"Nível 3\")+16*(J109=\"Nível 4\")+32*(J109=\"Serviço\"),2),0,1,2,3,4,\"S\")","v":"S"},{"$f":"IF(OR(A109=\"S\",A109=0),0,IF(ISERROR(I109),H109,SMALL(H109:I109,1)))","v":0},{"$f":"IF($A109=1,OFFSET(C109,-1,0)+1,OFFSET(C109,-1,0))","v":2},{"$f":"IF($A109=1,0,IF($A109=2,OFFSET(D109,-1,0)+1,OFFSET(D109,-1,0)))","v":4},{"$f":"IF(AND($A109<=2,$A109<>0),0,IF($A109=3,OFFSET(E109,-1,0)+1,OFFSET(E109,-1,0)))","v":0},{"$f":"IF(AND($A109<=3,$A109<>0),0,IF($A109=4,OFFSET(F109,-1,0)+1,OFFSET(F109,-1,0)))","v":0},{"$f":"IF(AND($A109<=4,$A109<>0),0,IF($A109=\"S\",OFFSET(G109,-1,0)+1,OFFSET(G109,-1,0)))","v":2},0,0,"Serviço",{"$f":"IF($A109=0,\"-\",CONCATENATE(C109&\".\",IF(AND($A$5>=2,$A109>=2),D109&\".\",\"\"),IF(AND($A$5>=3,$A109>=3),E109&\".\",\"\"),IF(AND($A$5>=4,$A109>=4),F109&\".\",\"\"),IF($A109=\"S\",G109&\".\",\"\")))","v":"2.4.0.0.2."},"SINAPI","97641","REMOÇÃO DE FORRO DE GESSO, DE FORMA MANUAL, SEM REAPROVEITAMENTO. AF_09/2023","M2",{"$f":"OFFSET(PLQ!$E$12,ROW($P109)-ROW(P$12),0)","v":244.8},3.01,"BDI 1",{"$f":"IF($A109=\"S\",IF($Q$10=\"Preço Unitário (R$)\",PO.CustoUnitario,ROUND(PO.CustoUnitario*(1+$Z109),15-13*$X$6)),0)","v":3.92},{"$f":"IF($A109=\"S\",VTOTAL1,IF($A109=0,0,ROUND(SomaAgrup,15-13*$X$7)))","v":959.62},{"$f":"IF($J109=\"\",\"\",IF($N109=\"\",\"DESCRIÇÃO\",IF(AND($J109=\"Serviço\",$O109=\"\"),\"UNIDADE\",IF($T109<=0,\"SEM VALOR\",IF(AND($Y109<>\"\",$Q109>$Y109),\"ACIMA REF.\",\"\")))))","v":""},{"$f":"IF(OR($A109=0,$A109=\"S\",$A109>CFF!$A$9),\"\",MAX(V$12:OFFSET(V109,-1,0))+1)","v":""},{"$f":"IF(AND($J109=\"Serviço\",$M109<>\"\"),IF($L109=\"\",$M109,CONCATENATE($L109,\"-\",$M109)))","v":"SINAPI-97641"},7887,3.01,{"$f":"ROUND(IF(ISNUMBER(R109),R109,IF(LEFT(R109,3)=\"BDI\",HLOOKUP(R109,DADOS!$T$37:$X$38,2,FALSE),0)),15-11*$X$5)","v":0.30209999999999998}]
[{"$f":"CHOOSE(1+LOG(1+2*(J110=\"Meta\")+4*(J110=\"Nível 2\")+8*(J110=\"Nível 3\")+16*(J110=\"Nível 4\")+32*(J110=\"Serviço\"),2),0,1,2,3,4,\"S\")","v":"S"},{"$f":"IF(OR(A110=\"S\",A110=0),0,IF(ISERROR(I110),H110,SMALL(H110:I110,1)))","v":0},{"$f":"IF($A110=1,OFFSET(C110,-1,0)+1,OFFSET(C110,-1,0))","v":2},{"$f":"IF($A110=1,0,IF($A110=2,OFFSET(D110,-1,0)+1,OFFSET(D110,-1,0)))","v":4},{"$f":"IF(AND($A110<=2,$A110<>0),0,IF($A110=3,OFFSET(E110,-1,0)+1,OFFSET(E110,-1,0)))","v":0},{"$f":"IF(AND($A110<=3,$A110<>0),0,IF($A110=4,OFFSET(F110,-1,0)+1,OFFSET(F110,-1,0)))","v":0},{"$f":"IF(AND($A110<=4,$A110<>0),0,IF($A110=\"S\",OFFSET(G110,-1,0)+1,OFFSET(G110,-1,0)))","v":3},0,0,"Serviço",{"$f":"IF($A110=0,\"-\",CONCATENATE(C110&\".\",IF(AND($A$5>=2,$A110>=2),D110&\".\",\"\"),IF(AND($A$5>=3,$A110>=3),E110&\".\",\"\"),IF(AND($A$5>=4,$A110>=4),F110&\".\",\"\"),IF($A110=\"S\",G110&\".\",\"\")))","v":"2.4.0.0.3."},"SINAPI","100274","TRANSPORTE HORIZONTAL MANUAL, DE COMPENSADO DE MADEIRA (UNIDADE: M2XKM). AF_07/2019","M2XKM",{"$f":"OFFSET(PLQ!$E$12,ROW($P110)-ROW(P$12),0)","v":6.12},29.04,"BDI 1",{"$f":"IF($A110=\"S\",IF($Q$10=\"Preço Unitário (R$)\",PO.CustoUnitario,ROUND(PO.CustoUnitario*(1+$Z110),15-13*$X$6)),0)","v":37.81},{"$f":"IF($A110=\"S\",VTOTAL1,IF($A110=0,0,ROUND(SomaAgrup,15-13*$X$7)))","v":231.4},{"$f":"IF($J110=\"\",\"\",IF($N110=\"\",\"DESCRIÇÃO\",IF(AND($J110=\"Serviço\",$O110=\"\"),\"UNIDADE\",IF($T110<=0,\"SEM VALOR\",IF(AND($Y110<>\"\",$Q110>$Y110),\"ACIMA REF.\",\"\")))))","v":""},{"$f":"IF(OR($A110=0,$A110=\"S\",$A110>CFF!$A$9),\"\",MAX(V$12:OFFSET(V110,-1,0))+1)","v":""},{"$f":"IF(AND($J110=\"Serviço\",$M110<>\"\"),IF($L110=\"\",$M110,CONCATENATE($L110,\"-\",$M110)))","v":"SINAPI-100274"},{"$f":"IF(AND(Fonte<>\"\",Código<>\"\"),MATCH(Fonte&\" \"&IF(Fonte=\"sinapi\",SUBSTITUTE(SUBSTITUTE(Código,\"/00\",\"/\"),\"/0\",\"/\"),Código),INDIRECT(\"'[Referência \"&_xlnm.Database&\".xls]Banco'!$a:$a\"),0),\"X\")","v":15249},{"$f":"IF(Import.Desoneracao=\"sim\",Referencia.Desonerado,Referencia.NaoDesonerado)","v":29.04},{"$f":"ROUND(IF(ISNUMBER(R110),R110,IF(LEFT(R110,3)=\"BDI\",HLOOKUP(R110,DADOS!$T$37:$X$38,2,FALSE),0)),15-11*$X$5)","v":0.30209999999999998}]
["S",0,2,4,0,0,4,0,0,"Serviço","2.4.0.0.4.","SINAPI","96114","FORRO EM DRYWALL, PARA AMBIENTES COMERCIAIS, INCLUSIVE ESTRUTURA BIRECIONAL DE FIXAÇÃO. AF_08/2023_PS","M2",{"$f":"OFFSET(PLQ!$E$12,ROW($P111)-ROW(P$12),0)","v":244.8},83.49,"BDI 1",108.71,26612.21,"",{"$f":"IF(OR($A111=0,$A111=\"S\",$A111>CFF!$A$9),\"\",MAX(V$12:OFFSET(V111,-1,0))+1)","v":""},"SINAPI-96114",9922,83.49,{"$f":"ROUND(IF(ISNUMBER(R111),R111,IF(LEFT(R111,3)=\"BDI\",HLOOKUP(R111,DADOS!$T$37:$X$38,2,FALSE),0)),15-11*$X$5)","v":0.30209999999999998}]
["S",0,2,4,0,0,5,0,0,"Serviço","2.4.0.0.5.","SINAPI","88496","EMASSAMENTO COM MASSA LÁTEX, APLICAÇÃO EM TETO, DUAS DEMÃOS, LIXAMENTO MANUAL. AF_04/2023","M2",{"$f":"OFFSET(PLQ!$E$12,ROW($P112)-ROW(P$12),0)","v":244.8},32.729999999999997,"BDI 1",42.62,10433.379999999999,"",{"$f":"IF(OR($A112=0,$A112=\"S\",$A112>CFF!$A$9),\"\",MAX(V$12:OFFSET(V112,-1,0))+1)","v":""},"SINAPI-88496",13877,32.729999999999997,{"$f":"ROUND(IF(ISNUMBER(R112),R112,IF(LEFT(R112,3)=\"BDI\",HLOOKUP(R112,DADOS!$T$37:$X$38,2,FALSE),0)),15-11*$X$5)","v":0.30209999999999998}]
["S",0,2,4,0,0,6,0,0,"Serviço","2.4.0.0.6.","SINAPI","88485","FUNDO SELADOR ACRÍLICO, APLICAÇÃO MANUAL EM PAREDE, UMA DEMÃO. AF_04/2023","M2",{"$f":"OFFSET(PLQ!$E$12,ROW($P113)-ROW(P$12),0)","v":244.8},3.77,"BDI 1",4.91,1201.97,"",{"$f":"IF(OR($A113=0,$A113=\"S\",$A113>CFF!$A$9),\"\",MAX(V$12:OFFSET(V113,-1,0))+1)","v":""},"SINAPI-88485",13881,3.77,{"$f":"ROUND(IF(ISNUMBER(R113),R113,IF(LEFT(R113,3)=\"BDI\",HLOOKUP(R113,DADOS!$T$37:$X$38,2,FALSE),0)),15-11*$X$5)","v":0.30209999999999998}]
["S",0,2,4,0,0,7,0,0,"Serviço","2.4.0.0.7.","SINAPI","88488","PINTURA LÁTEX ACRÍLICA PREMIUM, APLICAÇÃO MANUAL EM TETO, DUAS DEMÃOS. AF_04/2023","M2",{"$f":"OFFSET(PLQ!$E$12,ROW($P114)-ROW(P$12),0)","v":244.8},16.34,"BDI 1",21.28,5209.34,"",{"$f":"IF(OR($A114=0,$A114=\"S\",$A114>CFF!$A$9),\"\",MAX(V$12:OFFSET(V114,-1,0))+1)","v":""},"SINAPI-88488",13890,16.34,{"$f":"ROUND(IF(ISNUMBER(R114),R114,IF(LEFT(R114,3)=\"BDI\",HLOOKUP(R114,DADOS!$T$37:$X$38,2,FALSE),0)),15-11*$X$5)","v":0.30209999999999998}]
[2,14,2,5,0,0,0,22,14,"Nível 2","2.5.",null,null,"REVESTIMENTOS",{"$f":"Referencia.Unidade","v":""},{"$f":"OFFSET(PLQ!$E$12,ROW($P115)-ROW(P$12),0)","v":0},null,"BDI 1",0,49812.08,"",{"$f":"IF(OR($A115=0,$A115=\"S\",$A115>CFF!$A$9),\"\",MAX(V$12:OFFSET(V115,-1,0))+1)","v":15},false,"X",0,{"$f":"ROUND(IF(ISNUMBER(R115),R115,IF(LEFT(R115,3)=\"BDI\",HLOOKUP(R115,DADOS!$T$37:$X$38,2,FALSE),0)),15-11*$X$5)","v":0.30209999999999998}]
[3,7,2,5,1,0,0,13,7,"Nível 3","2.5.1.",null,null,"INTERNOS",{"$f":"Referencia.Unidade","v":""},{"$f":"OFFSET(PLQ!$E$12,ROW($P116)-ROW(P$12),0)","v":0},null,"BDI 1",0,26164.84,"",{"$f":"IF(OR($A116=0,$A116=\"S\",$A116>CFF!$A$9),\"\",MAX(V$12:OFFSET(V116,-1,0))+1)","v":""},false,"X",0,{"$f":"ROUND(IF(ISNUMBER(R116),R116,IF(LEFT(R116,3)=\"BDI\",HLOOKUP(R116,DADOS!$T$37:$X$38,2,FALSE),0)),15-11*$X$5)","v":0.30209999999999998}]
["S",0,2,5,1,0,1,0,0,"Serviço","2.5.1.0.1.","SINAPI","87879","CHAPISCO APLICADO EM ALVENARIAS E ESTRUTURAS DE CONCRETO INTERNAS, COM COLHER DE PEDREIRO. ARGAMASSA TRAÇO 1:3 COM PREPARO EM BETONEIRA 400L. AF_10/2022","M2",{"$f":"OFFSET(PLQ!$E$12,ROW($P117)-ROW(P$12),0)","v":105.68},4.74,"BDI 1",6.17,652.04999999999995,"",{"$f":"IF(OR($A117=0,$A117=\"S\",$A117>CFF!$A$9),\"\",MAX(V$12:OFFSET(V117,-1,0))+1)","v":""},"SINAPI-87879",7292,4.74,{"$f":"ROUND(IF(ISNUMBER(R117),R117,IF(LEFT(R117,3)=\"BDI\",HLOOKUP(R117,DADOS!$T$37:$X$38,2,FALSE),0)),15-11*$X$5)","v":0.30209999999999998}]
["S",0,2,5,1,0,2,0,0,"Serviço","2.5.1.0.2.","SINAPI","87775","EMBOÇO OU MASSA ÚNICA EM ARGAMASSA TRAÇO 1:2:8, PREPARO MECÂNICO COM BETONEIRA 400 L, APLICADA MANUALMENTE EM PANOS DE FACHADA COM PRESENÇA DE VÃOS, ESPESSURA DE 25 MM. AF_08/2022","M2",{"$f":"OFFSET(PLQ!$E$12,ROW($P118)-ROW(P$12),0)","v":105.68},55.76,"BDI 1",72.61,7673.42,"",{"$f":"IF(OR($A118=0,$A118=\"S\",$A118>CFF!$A$9),\"\",MAX(V$12:OFFSET(V118,-1,0))+1)","v":""},"SINAPI-87775",13405,55.76,{"$f":"ROUND(IF(ISNUMBER(R118),R118,IF(LEFT(R118,3)=\"BDI\",HLOOKUP(R118,DADOS!$T$37:$X$38,2,FALSE),0)),15-11*$X$5)","v":0.30209999999999998}]
[{"$f":"CHOOSE(1+LOG(1+2*(J119=\"Meta\")+4*(J119=\"Nível 2\")+8*(J119=\"Nível 3\")+16*(J119=\"Nível 4\")+32*(J119=\"Serviço\"),2),0,1,2,3,4,\"S\")","v":"S"},{"$f":"IF(OR(A119=\"S\",A119=0),0,IF(ISERROR(I119),H119,SMALL(H119:I119,1)))","v":0},{"$f":"IF($A119=1,OFFSET(C119,-1,0)+1,OFFSET(C119,-1,0))","v":2},{"$f":"IF($A119=1,0,IF($A119=2,OFFSET(D119,-1,0)+1,OFFSET(D119,-1,0)))","v":5},{"$f":"IF(AND($A119<=2,$A119<>0),0,IF($A119=3,OFFSET(E119,-1,0)+1,OFFSET(E119,-1,0)))","v":1},{"$f":"IF(AND($A119<=3,$A119<>0),0,IF($A119=4,OFFSET(F119,-1,0)+1,OFFSET(F119,-1,0)))","v":0},{"$f":"IF(AND($A119<=4,$A119<>0),0,IF($A119=\"S\",OFFSET(G119,-1,0)+1,OFFSET(G119,-1,0)))","v":3},0,0,"Serviço",{"$f":"IF($A119=0,\"-\",CONCATENATE(C119&\".\",IF(AND($A$5>=2,$A119>=2),D119&\".\",\"\"),IF(AND($A$5>=3,$A119>=3),E119&\".\",\"\"),IF(AND($A$5>=4,$A119>=4),F119&\".\",\"\"),IF($A119=\"S\",G119&\".\",\"\")))","v":"2.5.1.0.3."},"SINAPI","87269","REVESTIMENTO CERÂMICO PARA PAREDES INTERNAS COM PLACAS TIPO ESMALTADA DE DIMENSÕES 25X35 CM APLICADAS NA ALTURA INTEIRA DAS PAREDES. AF_02/2023_PE","M2",{"$f":"OFFSET(PLQ!$E$12,ROW($P119)-ROW(P$12),0)","v":22.33},64.03,"BDI 1",{"$f":"IF($A119=\"S\",IF($Q$10=\"Preço Unitário (R$)\",PO.CustoUnitario,ROUND(PO.CustoUnitario*(1+$Z119),15-13*$X$6)),0)","v":83.37},{"$f":"IF($A119=\"S\",VTOTAL1,IF($A119=0,0,ROUND(SomaAgrup,15-13*$X$7)))","v":1861.65},{"$f":"IF($J119=\"\",\"\",IF($N119=\"\",\"DESCRIÇÃO\",IF(AND($J119=\"Serviço\",$O119=\"\"),\"UNIDADE\",IF($T119<=0,\"SEM VALOR\",IF(AND($Y119<>\"\",$Q119>$Y119),\"ACIMA REF.\",\"\")))))","v":""},{"$f":"IF(OR($A119=0,$A119=\"S\",$A119>CFF!$A$9),\"\",MAX(V$12:OFFSET(V119,-1,0))+1)","v":""},{"$f":"IF(AND($J119=\"Serviço\",$M119<>\"\"),IF($L119=\"\",$M119,CONCATENATE($L119,\"-\",$M119)))","v":"SINAPI-87269"},{"$f":"IF(AND(Fonte<>\"\",Código<>\"\"),MATCH(Fonte&\" \"&IF(Fonte=\"sinapi\",SUBSTITUTE(SUBSTITUTE(Código,\"/00\",\"/\"),\"/0\",\"/\"),Código),INDIRECT(\"'[Referência \"&_xlnm.Database&\".xls]Banco'!$a:$a\"),0),\"X\")","v":14827},{"$f":"IF(Import.Desoneracao=\"sim\",Referencia.Desonerado,Referencia.NaoDesonerado)","v":64.03},{"$f":"ROUND(IF(ISNUMBER(R119),R119,IF(LEFT(R119,3)=\"BDI\",HLOOKUP(R119,DADOS!$T$37:$X$38,2,FALSE),0)),15-11*$X$5)","v":0.30209999999999998}]
["S",0,2,5,1,0,4,0,0,"Serviço","2.5.1.0.4.","COMPOSIÇÃO","SINAPI88497ADPTADA","EMASSAMENTO COM MASSA LÁTEX, APLICAÇÃO EM PAREDE, TRÊS DEMÂOS, LIXAMENTO MANUAL","M2",{"$f":"OFFSET(PLQ!$E$12,ROW($P120)-ROW(P$12),0)","v":105.68},28.53,"BDI 1",37.15,3926.01,"",{"$f":"IF(OR($A120=0,$A120=\"S\",$A120>CFF!$A$9),\"\",MAX(V$12:OFFSET(V120,-1,0))+1)","v":""},"COMPOSIÇÃO-SINAPI88497ADPTADA",8,28.53,{"$f":"ROUND(IF(ISNUMBER(R120),R120,IF(LEFT(R120,3)=\"BDI\",HLOOKUP(R120,DADOS!$T$37:$X$38,2,FALSE),0)),15-11*$X$5)","v":0.30209999999999998}]
["S",0,2,5,1,0,5,0,0,"Serviço","2.5.1.0.5.","SINAPI","88485","FUNDO SELADOR ACRÍLICO, APLICAÇÃO MANUAL EM PAREDE, UMA DEMÃO. AF_04/2023","M2",{"$f":"OFFSET(PLQ!$E$12,ROW($P121)-ROW(P$12),0)","v":105.68},3.77,"BDI 1",4.91,518.89,"",{"$f":"IF(OR($A121=0,$A121=\"S\",$A121>CFF!$A$9),\"\",MAX(V$12:OFFSET(V121,-1,0))+1)","v":""},"SINAPI-88485",13881,3.77,{"$f":"ROUND(IF(ISNUMBER(R121),R121,IF(LEFT(R121,3)=\"BDI\",HLOOKUP(R121,DADOS!$T$37:$X$38,2,FALSE),0)),15-11*$X$5)","v":0.30209999999999998}]
["S",0,2,5,1,0,6,0,0,"Serviço","2.5.1.0.6.","SINAPI","95626","APLICAÇÃO MANUAL DE TINTA LÁTEX ACRÍLICA EM PAREDE EXTERNAS DE CASAS, DUAS DEMÃOS. AF_03/2024","M2",{"$f":"OFFSET(PLQ!$E$12,ROW($P122)-ROW(P$12),0)","v":533.67999999999995},16.600000000000001,"BDI 1",21.61,11532.82,"",{"$f":"IF(OR($A122=0,$A122=\"S\",$A122>CFF!$A$9),\"\",MAX(V$12:OFFSET(V122,-1,0))+1)","v":""},"SINAPI-95626",13870,16.600000000000001,{"$f":"ROUND(IF(ISNUMBER(R122),R122,IF(LEFT(R122,3)=\"BDI\",HLOOKUP(R122,DADOS!$T$37:$X$38,2,FALSE),0)),15-11*$X$5)","v":0.30209999999999998}]
[3,6,2,5,2,0,0,6,20,"Nível 3","2.5.2.",null,null,"EXTERNO",{"$f":"Referencia.Unidade","v":""},{"$f":"OFFSET(PLQ!$E$12,ROW($P123)-ROW(P$12),0)","v":0},null,"BDI 1",0,23647.24,"",{"$f":"IF(OR($A123=0,$A123=\"S\",$A123>CFF!$A$9),\"\",MAX(V$12:OFFSET(V123,-1,0))+1)","v":""},false,"X",0,{"$f":"ROUND(IF(ISNUMBER(R123),R123,IF(LEFT(R123,3)=\"BDI\",HLOOKUP(R123,DADOS!$T$37:$X$38,2,FALSE),0)),15-11*$X$5)","v":0.30209999999999998}]
["S",0,2,5,2,0,1,0,0,"Serviço","2.5.2.0.1.","SINAPI","87905","CHAPISCO APLICADO EM ALVENARIA (COM PRESENÇA DE VÃOS) E ESTRUTURAS DE CONCRETO DE FACHADA, COM COLHER DE PEDREIRO. ARGAMASSA TRAÇO 1:3 COM PREPARO EM BETONEIRA 400L. AF_10/2022","M2",{"$f":"OFFSET(PLQ!$E$12,ROW($P124)-ROW(P$12),0)","v":137.4},8.25,"BDI 1",10.74,1475.68,"",{"$f":"IF(OR($A124=0,$A124=\"S\",$A124>CFF!$A$9),\"\",MAX(V$12:OFFSET(V124,-1,0))+1)","v":""},"SINAPI-87905",7274,8.25,{"$f":"ROUND(IF(ISNUMBER(R124),R124,IF(LEFT(R124,3)=\"BDI\",HLOOKUP(R124,DADOS!$T$37:$X$38,2,FALSE),0)),15-11*$X$5)","v":0.30209999999999998}]
["S",0,2,5,2,0,2,0,0,"Serviço","2.5.2.0.2.","SINAPI","87775","EMBOÇO OU MASSA ÚNICA EM ARGAMASSA TRAÇO 1:2:8, PREPARO MECÂNICO COM BETONEIRA 400 L, APLICADA MANUALMENTE EM PANOS DE FACHADA COM PRESENÇA DE VÃOS, ESPESSURA DE 25 MM. AF_08/2022","M2",{"$f":"OFFSET(PLQ!$E$12,ROW($P125)-ROW(P$12),0)","v":137.4},55.76,"BDI 1",72.61,9976.61,"",{"$f":"IF(OR($A125=0,$A125=\"S\",$A125>CFF!$A$9),\"\",MAX(V$12:OFFSET(V125,-1,0))+1)","v":""},"SINAPI-87775",13405,55.76,{"$f":"ROUND(IF(ISNUMBER(R125),R125,IF(LEFT(R125,3)=\"BDI\",HLOOKUP(R125,DADOS!$T$37:$X$38,2,FALSE),0)),15-11*$X$5)","v":0.30209999999999998}]
["S",0,2,5,2,0,3,0,0,"Serviço","2.5.2.0.3.","SINAPI","95305","TEXTURA ACRÍLICA, APLICAÇÃO MANUAL EM PAREDE, UMA DEMÃO. AF_04/2023","M2",{"$f":"OFFSET(PLQ!$E$12,ROW($P126)-ROW(P$12),0)","v":137.4},14.99,"BDI 1",19.52,2682.05,"",{"$f":"IF(OR($A126=0,$A126=\"S\",$A126>CFF!$A$9),\"\",MAX(V$12:OFFSET(V126,-1,0))+1)","v":""},"SINAPI-95305",13893,14.99,{"$f":"ROUND(IF(ISNUMBER(R126),R126,IF(LEFT(R126,3)=\"BDI\",HLOOKUP(R126,DADOS!$T$37:$X$38,2,FALSE),0)),15-11*$X$5)","v":0.30209999999999998}]
["S",0,2,5,2,0,4,0,0,"Serviço","2.5.2.0.4.","SINAPI","88485","FUNDO SELADOR ACRÍLICO, APLICAÇÃO MANUAL EM PAREDE, UMA DEMÃO. AF_04/2023","M2",{"$f":"OFFSET(PLQ!$E$12,ROW($P127)-ROW(P$12),0)","v":137.4},3.77,"BDI 1",4.91,674.63,"",{"$f":"IF(OR($A127=0,$A127=\"S\",$A127>CFF!$A$9),\"\",MAX(V$12:OFFSET(V127,-1,0))+1)","v":""},"SINAPI-88485",13881,3.77,{"$f":"ROUND(IF(ISNUMBER(R127),R127,IF(LEFT(R127,3)=\"BDI\",HLOOKUP(R127,DADOS!$T$37:$X$38,2,FALSE),0)),15-11*$X$5)","v":0.30209999999999998}]
["S",0,2,5,2,0,5,0,0,"Serviço","2.5.2.0.5.","SINAPI","95626","APLICAÇÃO MANUAL DE TINTA LÁTEX ACRÍLICA EM PAREDE EXTERNAS DE CASAS, DUAS DEMÃOS. AF_03/2024","M2",{"$f":"OFFSET(PLQ!$E$12,ROW($P128)-ROW(P$12),0)","v":408.99},16.600000000000001,"BDI 1",21.61,8838.27,"",{"$f":"IF(OR($A128=0,$A128=\"S\",$A128>CFF!$A$9),\"\",MAX(V$12:OFFSET(V128,-1,0))+1)","v":""},"SINAPI-95626",13870,16.600000000000001,{"$f":"ROUND(IF(ISNUMBER(R128),R128,IF(LEFT(R128,3)=\"BDI\",HLOOKUP(R128,DADOS!$T$37:$X$38,2,FALSE),0)),15-11*$X$5)","v":0.30209999999999998}]
[2,8,2,6,0,0,0,8,{"$error":"#N/A"},"Nível 2","2.6.",null,null,"PAVIMENTAÇÃO",{"$f":"Referencia.Unidade","v":""},{"$f":"OFFSET(PLQ!$E$12,ROW($P129)-ROW(P$12),0)","v":0},null,"BDI 1",0,84147.38,"",{"$f":"IF(OR($A129=0,$A129=\"S\",$A129>CFF!$A$9),\"\",MAX(V$12:OFFSET(V129,-1,0))+1)","v":16},false,"X",0,{"$f":"ROUND(IF(ISNUMBER(R129),R129,IF(LEFT(R129,3)=\"BDI\",HLOOKUP(R129,DADOS!$T$37:$X$38,2,FALSE),0)),15-11*$X$5)","v":0.30209999999999998}]
[{"$f":"CHOOSE(1+LOG(1+2*(J130=\"Meta\")+4*(J130=\"Nível 2\")+8*(J130=\"Nível 3\")+16*(J130=\"Nível 4\")+32*(J130=\"Serviço\"),2),0,1,2,3,4,\"S\")","v":"S"},{"$f":"IF(OR(A130=\"S\",A130=0),0,IF(ISERROR(I130),H130,SMALL(H130:I130,1)))","v":0},{"$f":"IF($A130=1,OFFSET(C130,-1,0)+1,OFFSET(C130,-1,0))","v":2},{"$f":"IF($A130=1,0,IF($A130=2,OFFSET(D130,-1,0)+1,OFFSET(D130,-1,0)))","v":6},{"$f":"IF(AND($A130<=2,$A130<>0),0,IF($A130=3,OFFSET(E130,-1,0)+1,OFFSET(E130,-1,0)))","v":0},{"$f":"IF(AND($A130<=3,$A130<>0),0,IF($A130=4,OFFSET(F130,-1,0)+1,OFFSET(F130,-1,0)))","v":0},{"$f":"IF(AND($A130<=4,$A130<>0),0,IF($A130=\"S\",OFFSET(G130,-1,0)+1,OFFSET(G130,-1,0)))","v":1},0,0,"Serviço",{"$f":"IF($A130=0,\"-\",CONCATENATE(C130&\".\",IF(AND($A$5>=2,$A130>=2),D130&\".\",\"\"),IF(AND($A$5>=3,$A130>=3),E130&\".\",\"\"),IF(AND($A$5>=4,$A130>=4),F130&\".\",\"\"),IF($A130=\"S\",G130&\".\",\"\")))","v":"2.6.0.0.1."},"SINAPI","97634","DEMOLIÇÃO DE REVESTIMENTO CERÂMICO, DE FORMA MECANIZADA COM MARTELETE, SEM REAPROVEITAMENTO. AF_09/2023","M2",{"$f":"OFFSET(PLQ!$E$12,ROW($P130)-ROW(P$12),0)","v":475.56},8.2100000000000009,"BDI 1",{"$f":"IF($A130=\"S\",IF($Q$10=\"Preço Unitário (R$)\",PO.CustoUnitario,ROUND(PO.CustoUnitario*(1+$Z130),15-13*$X$6)),0)","v":10.69},{"$f":"IF($A130=\"S\",VTOTAL1,IF($A130=0,0,ROUND(SomaAgrup,15-13*$X$7)))","v":5083.74},{"$f":"IF($J130=\"\",\"\",IF($N130=\"\",\"DESCRIÇÃO\",IF(AND($J130=\"Serviço\",$O130=\"\"),\"UNIDADE\",IF($T130<=0,\"SEM VALOR\",IF(AND($Y130<>\"\",$Q130>$Y130),\"ACIMA REF.\",\"\")))))","v":""},{"$f":"IF(OR($A130=0,$A130=\"S\",$A130>CFF!$A$9),\"\",MAX(V$12:OFFSET(V130,-1,0))+1)","v":""},{"$f":"IF(AND($J130=\"Serviço\",$M130<>\"\"),IF($L130=\"\",$M130,CONCATENATE($L130,\"-\",$M130)))","v":"SINAPI-97634"},7873,8.2100000000000009,{"$f":"ROUND(IF(ISNUMBER(R130),R130,IF(LEFT(R130,3)=\"BDI\",HLOOKUP(R130,DADOS!$T$37:$X$38,2,FALSE),0)),15-11*$X$5)","v":0.30209999999999998}]
[{"$f":"CHOOSE(1+LOG(1+2*(J131=\"Meta\")+4*(J131=\"Nível 2\")+8*(J131=\"Nível 3\")+16*(J131=\"Nível 4\")+32*(J131=\"Serviço\"),2),0,1,2,3,4,\"S\")","v":"S"},{"$f":"IF(OR(A131=\"S\",A131=0),0,IF(ISERROR(I131),H131,SMALL(H131:I131,1)))","v":0},{"$f":"IF($A131=1,OFFSET(C131,-1,0)+1,OFFSET(C131,-1,0))","v":2},{"$f":"IF($A131=1,0,IF($A131=2,OFFSET(D131,-1,0)+1,OFFSET(D131,-1,0)))","v":6},{"$f":"IF(AND($A131<=2,$A131<>0),0,IF($A131=3,OFFSET(E131,-1,0)+1,OFFSET(E131,-1,0)))","v":0},{"$f":"IF(AND($A131<=3,$A131<>0),0,IF($A131=4,OFFSET(F131,-1,0)+1,OFFSET(F131,-1,0)))","v":0},{"$f":"IF(AND($A131<=4,$A131<>0),0,IF($A131=\"S\",OFFSET(G131,-1,0)+1,OFFSET(G131,-1,0)))","v":2},0,0,"Serviço",{"$f":"IF($A131=0,\"-\",CONCATENATE(C131&\".\",IF(AND($A$5>=2,$A131>=2),D131&\".\",\"\"),IF(AND($A$5>=3,$A131>=3),E131&\".\",\"\"),IF(AND($A$5>=4,$A131>=4),F131&\".\",\"\"),IF($A131=\"S\",G131&\".\",\"\")))","v":"2.6.0.0.2."},"SINAPI","97632","DEMOLIÇÃO DE RODAPÉ CERÂMICO, DE FORMA MANUAL, SEM REAPROVEITAMENTO. AF_09/2023","M",{"$f":"OFFSET(PLQ!$E$12,ROW($P131)-ROW(P$12),0)","v":193.03},2.68,"BDI 1",{"$f":"IF($A131=\"S\",IF($Q$10=\"Preço Unitário (R$)\",PO.CustoUnitario,ROUND(PO.CustoUnitario*(1+$Z131),15-13*$X$6)),0)","v":3.49},{"$f":"IF($A131=\"S\",VTOTAL1,IF($A131=0,0,ROUND(SomaAgrup,15-13*$X$7)))","v":673.67},{"$f":"IF($J131=\"\",\"\",IF($N131=\"\",\"DESCRIÇÃO\",IF(AND($J131=\"Serviço\",$O131=\"\"),\"UNIDADE\",IF($T131<=0,\"SEM VALOR\",IF(AND($Y131<>\"\",$Q131>$Y131),\"ACIMA REF.\",\"\")))))","v":""},{"$f":"IF(OR($A131=0,$A131=\"S\",$A131>CFF!$A$9),\"\",MAX(V$12:OFFSET(V131,-1,0))+1)","v":""},{"$f":"IF(AND($J131=\"Serviço\",$M131<>\"\"),IF($L131=\"\",$M131,CONCATENATE($L131,\"-\",$M131)))","v":"SINAPI-97632"},7874,{"$f":"IF(Import.Desoneracao=\"sim\",Referencia.Desonerado,Referencia.NaoDesonerado)","v":2.68},{"$f":"ROUND(IF(ISNUMBER(R131),R131,IF(LEFT(R131,3)=\"BDI\",HLOOKUP(R131,DADOS!$T$37:$X$38,2,FALSE),0)),15-11*$X$5)","v":0.30209999999999998}]
["S",0,{"$f":"IF($A132=1,OFFSET(C132,-1,0)+1,OFFSET(C132,-1,0))","v":2},{"$f":"IF($A132=1,0,IF($A132=2,OFFSET(D132,-1,0)+1,OFFSET(D132,-1,0)))","v":6},{"$f":"IF(AND($A132<=2,$A132<>0),0,IF($A132=3,OFFSET(E132,-1,0)+1,OFFSET(E132,-1,0)))","v":0},{"$f":"IF(AND($A132<=3,$A132<>0),0,IF($A132=4,OFFSET(F132,-1,0)+1,OFFSET(F132,-1,0)))","v":0},{"$f":"IF(AND($A132<=4,$A132<>0),0,IF($A132=\"S\",OFFSET(G132,-1,0)+1,OFFSET(G132,-1,0)))","v":3},0,0,"Serviço",{"$f":"IF($A132=0,\"-\",CONCATENATE(C132&\".\",IF(AND($A$5>=2,$A132>=2),D132&\".\",\"\"),IF(AND($A$5>=3,$A132>=3),E132&\".\",\"\"),IF(AND($A$5>=4,$A132>=4),F132&\".\",\"\"),IF($A132=\"S\",G132&\".\",\"\")))","v":"2.6.0.0.3."},"SINAPI","104790","DEMOLIÇÃO DE PISO DE CONCRETO SIMPLES, DE FORMA MECANIZADA COM MARTELETE, SEM REAPROVEITAMENTO. AF_09/2023","M3",{"$f":"OFFSET(PLQ!$E$12,ROW($P132)-ROW(P$12),0)","v":0.23},124.95,"BDI 1",{"$f":"IF($A132=\"S\",IF($Q$10=\"Preço Unitário (R$)\",PO.CustoUnitario,ROUND(PO.CustoUnitario*(1+$Z132),15-13*$X$6)),0)","v":162.69999999999999},{"$f":"IF($A132=\"S\",VTOTAL1,IF($A132=0,0,ROUND(SomaAgrup,15-13*$X$7)))","v":37.42},{"$f":"IF($J132=\"\",\"\",IF($N132=\"\",\"DESCRIÇÃO\",IF(AND($J132=\"Serviço\",$O132=\"\"),\"UNIDADE\",IF($T132<=0,\"SEM VALOR\",IF(AND($Y132<>\"\",$Q132>$Y132),\"ACIMA REF.\",\"\")))))","v":""},{"$f":"IF(OR($A132=0,$A132=\"S\",$A132>CFF!$A$9),\"\",MAX(V$12:OFFSET(V132,-1,0))+1)","v":""},{"$f":"IF(AND($J132=\"Serviço\",$M132<>\"\"),IF($L132=\"\",$M132,CONCATENATE($L132,\"-\",$M132)))","v":"SINAPI-104790"},7871,{"$f":"IF(Import.Desoneracao=\"sim\",Referencia.Desonerado,Referencia.NaoDesonerado)","v":124.95},{"$f":"ROUND(IF(ISNUMBER(R132),R132,IF(LEFT(R132,3)=\"BDI\",HLOOKUP(R132,DADOS!$T$37:$X$38,2,FALSE),0)),15-11*$X$5)","v":0.30209999999999998}]
[{"$f":"CHOOSE(1+LOG(1+2*(J133=\"Meta\")+4*(J133=\"Nível 2\")+8*(J133=\"Nível 3\")+16*(J133=\"Nível 4\")+32*(J133=\"Serviço\"),2),0,1,2,3,4,\"S\")","v":"S"},{"$f":"IF(OR(A133=\"S\",A133=0),0,IF(ISERROR(I133),H133,SMALL(H133:I133,1)))","v":0},{"$f":"IF($A133=1,OFFSET(C133,-1,0)+1,OFFSET(C133,-1,0))","v":2},{"$f":"IF($A133=1,0,IF($A133=2,OFFSET(D133,-1,0)+1,OFFSET(D133,-1,0)))","v":6},{"$f":"IF(AND($A133<=2,$A133<>0),0,IF($A133=3,OFFSET(E133,-1,0)+1,OFFSET(E133,-1,0)))","v":0},{"$f":"IF(AND($A133<=3,$A133<>0),0,IF($A133=4,OFFSET(F133,-1,0)+1,OFFSET(F133,-1,0)))","v":0},{"$f":"IF(AND($A133<=4,$A133<>0),0,IF($A133=\"S\",OFFSET(G133,-1,0)+1,OFFSET(G133,-1,0)))","v":4},0,0,"Serviço",{"$f":"IF($A133=0,\"-\",CONCATENATE(C133&\".\",IF(AND($A$5>=2,$A133>=2),D133&\".\",\"\"),IF(AND($A$5>=3,$A133>=3),E133&\".\",\"\"),IF(AND($A$5>=4,$A133>=4),F133&\".\",\"\"),IF($A133=\"S\",G133&\".\",\"\")))","v":"2.6.0.0.4."},"SINAPI","104791","DEMOLIÇÃO DE ARGAMASSAS, DE FORMA DE FORMA MECANIZADA COM MARTELETE, SEM REAPROVEITAMENTO. AF_09/2023","M2",{"$f":"OFFSET(PLQ!$E$12,ROW($P133)-ROW(P$12),0)","v":22.57},7.53,"BDI 1",{"$f":"IF($A133=\"S\",IF($Q$10=\"Preço Unitário (R$)\",PO.CustoUnitario,ROUND(PO.CustoUnitario*(1+$Z133),15-13*$X$6)),0)","v":9.8000000000000007},{"$f":"IF($A133=\"S\",VTOTAL1,IF($A133=0,0,ROUND(SomaAgrup,15-13*$X$7)))","v":221.19},{"$f":"IF($J133=\"\",\"\",IF($N133=\"\",\"DESCRIÇÃO\",IF(AND($J133=\"Serviço\",$O133=\"\"),\"UNIDADE\",IF($T133<=0,\"SEM VALOR\",IF(AND($Y133<>\"\",$Q133>$Y133),\"ACIMA REF.\",\"\")))))","v":""},{"$f":"IF(OR($A133=0,$A133=\"S\",$A133>CFF!$A$9),\"\",MAX(V$12:OFFSET(V133,-1,0))+1)","v":""},{"$f":"IF(AND($J133=\"Serviço\",$M133<>\"\"),IF($L133=\"\",$M133,CONCATENATE($L133,\"-\",$M133)))","v":"SINAPI-104791"},7862,{"$f":"IF(Import.Desoneracao=\"sim\",Referencia.Desonerado,Referencia.NaoDesonerado)","v":7.53},{"$f":"ROUND(IF(ISNUMBER(R133),R133,IF(LEFT(R133,3)=\"BDI\",HLOOKUP(R133,DADOS!$T$37:$X$38,2,FALSE),0)),15-11*$X$5)","v":0.30209999999999998}]
["S",0,2,6,0,0,5,0,0,"Serviço","2.6.0.0.5.","COMPOSIÇÃO","SINAPI98555ADAPTADA","REBOCO IMPERMEÁVEL E=3CM","M2",{"$f":"OFFSET(PLQ!$E$12,ROW($P134)-ROW(P$12),0)","v":30.1},42.28,"BDI 1",{"$f":"IF($A134=\"S\",IF($Q$10=\"Preço Unitário (R$)\",PO.CustoUnitario,ROUND(PO.CustoUnitario*(1+$Z134),15-13*$X$6)),0)","v":55.05},{"$f":"IF($A134=\"S\",VTOTAL1,IF($A134=0,0,ROUND(SomaAgrup,15-13*$X$7)))","v":1657.01},"",{"$f":"IF(OR($A134=0,$A134=\"S\",$A134>CFF!$A$9),\"\",MAX(V$12:OFFSET(V134,-1,0))+1)","v":""},"COMPOSIÇÃO-SINAPI98555ADAPTADA",16,{"$f":"IF(Import.Desoneracao=\"sim\",Referencia.Desonerado,Referencia.NaoDesonerado)","v":42.28},{"$f":"ROUND(IF(ISNUMBER(R134),R134,IF(LEFT(R134,3)=\"BDI\",HLOOKUP(R134,DADOS!$T$37:$X$38,2,FALSE),0)),15-11*$X$5)","v":0.30209999999999998}]
["S",0,2,6,0,0,6,0,0,"Serviço","2.6.0.0.6.","SINAPI","104598","REVESTIMENTO CERÂMICO PARA PISO COM PLACAS TIPO PORCELANATO DE DIMENSÕES 80X80 CM APLICADA EM AMBIENTES DE ÁREA MAIOR QUE 10 M². AF_02/2023_PE","M2",{"$f":"OFFSET(PLQ!$E$12,ROW($P135)-ROW(P$12),0)","v":475.56},117.63,"BDI 1",153.16999999999999,72841.53,"",{"$f":"IF(OR($A135=0,$A135=\"S\",$A135>CFF!$A$9),\"\",MAX(V$12:OFFSET(V135,-1,0))+1)","v":""},"SINAPI-104598",14858,117.63,{"$f":"ROUND(IF(ISNUMBER(R135),R135,IF(LEFT(R135,3)=\"BDI\",HLOOKUP(R135,DADOS!$T$37:$X$38,2,FALSE),0)),15-11*$X$5)","v":0.30209999999999998}]
["S",0,2,6,0,0,7,0,0,"Serviço","2.6.0.0.7.","SINAPI","104619","RODAPÉ CERÂMICO DE 7CM DE ALTURA COM PLACAS TIPO ESMALTADA DE DIMENSÕES 80X80CM. AF_02/2023","M",{"$f":"OFFSET(PLQ!$E$12,ROW($P136)-ROW(P$12),0)","v":193.03},14.45,"BDI 1",18.82,3632.82,"",{"$f":"IF(OR($A136=0,$A136=\"S\",$A136>CFF!$A$9),\"\",MAX(V$12:OFFSET(V136,-1,0))+1)","v":""},"SINAPI-104619",14863,14.45,{"$f":"ROUND(IF(ISNUMBER(R136),R136,IF(LEFT(R136,3)=\"BDI\",HLOOKUP(R136,DADOS!$T$37:$X$38,2,FALSE),0)),15-11*$X$5)","v":0.30209999999999998}]
[{"$f":"CHOOSE(1+LOG(1+2*(J137=\"Meta\")+4*(J137=\"Nível 2\")+8*(J137=\"Nível 3\")+16*(J137=\"Nível 4\")+32*(J137=\"Serviço\"),2),0,1,2,3,4,\"S\")","v":1},{"$f":"IF(OR(A137=\"S\",A137=0),0,IF(ISERROR(I137),H137,SMALL(H137:I137,1)))","v":8},{"$f":"IF($A137=1,OFFSET(C137,-1,0)+1,OFFSET(C137,-1,0))","v":3},{"$f":"IF($A137=1,0,IF($A137=2,OFFSET(D137,-1,0)+1,OFFSET(D137,-1,0)))","v":0},{"$f":"IF(AND($A137<=2,$A137<>0),0,IF($A137=3,OFFSET(E137,-1,0)+1,OFFSET(E137,-1,0)))","v":0},{"$f":"IF(AND($A137<=3,$A137<>0),0,IF($A137=4,OFFSET(F137,-1,0)+1,OFFSET(F137,-1,0)))","v":0},{"$f":"IF(AND($A137<=4,$A137<>0),0,IF($A137=\"S\",OFFSET(G137,-1,0)+1,OFFSET(G137,-1,0)))","v":0},{"$f":"IF(OR($A137=\"S\",$A137=0),0,MATCH(0,OFFSET($B137,1,$A137,ROW($A$145)-ROW($A137)),0))","v":8},{"$f":"IF(OR($A137=\"S\",$A137=0),0,MATCH(OFFSET($B137,0,$A137)+1,OFFSET($B137,1,$A137,ROW($A$145)-ROW($A137)),0))","v":{"$error":"#N/A"}},"Meta",{"$f":"IF($A137=0,\"-\",CONCATENATE(C137&\".\",IF(AND($A$5>=2,$A137>=2),D137&\".\",\"\"),IF(AND($A$5>=3,$A137>=3),E137&\".\",\"\"),IF(AND($A$5>=4,$A137>=4),F137&\".\",\"\"),IF($A137=\"S\",G137&\".\",\"\")))","v":"3."},null,null,"LOTE 2 - FACHADA EM ACM 1ª ETAPA",{"$f":"Referencia.Unidade","v":""},{"$f":"OFFSET(PLQ!$E$12,ROW($P137)-ROW(P$12),0)","v":0},null,"BDI 1",{"$f":"IF($A137=\"S\",IF($Q$10=\"Preço Unitário (R$)\",PO.CustoUnitario,ROUND(PO.CustoUnitario*(1+$Z137),15-13*$X$6)),0)","v":0},{"$f":"IF($A137=\"S\",VTOTAL1,IF($A137=0,0,ROUND(SomaAgrup,15-13*$X$7)))","v":103430.77},{"$f":"IF($J137=\"\",\"\",IF($N137=\"\",\"DESCRIÇÃO\",IF(AND($J137=\"Serviço\",$O137=\"\"),\"UNIDADE\",IF($T137<=0,\"SEM VALOR\",IF(AND($Y137<>\"\",$Q137>$Y137),\"ACIMA REF.\",\"\")))))","v":""},{"$f":"IF(OR($A137=0,$A137=\"S\",$A137>CFF!$A$9),\"\",MAX(V$12:OFFSET(V137,-1,0))+1)","v":17},{"$f":"IF(AND($J137=\"Serviço\",$M137<>\"\"),IF($L137=\"\",$M137,CONCATENATE($L137,\"-\",$M137)))","v":false},"X",{"$f":"IF(Import.Desoneracao=\"sim\",Referencia.Desonerado,Referencia.NaoDesonerado)","v":0},{"$f":"ROUND(IF(ISNUMBER(R137),R137,IF(LEFT(R137,3)=\"BDI\",HLOOKUP(R137,DADOS!$T$37:$X$38,2,FALSE),0)),15-11*$X$5)","v":0.30209999999999998}]
[{"$f":"CHOOSE(1+LOG(1+2*(J138=\"Meta\")+4*(J138=\"Nível 2\")+8*(J138=\"Nível 3\")+16*(J138=\"Nível 4\")+32*(J138=\"Serviço\"),2),0,1,2,3,4,\"S\")","v":3},{"$f":"IF(OR(A138=\"S\",A138=0),0,IF(ISERROR(I138),H138,SMALL(H138:I138,1)))","v":3},3,0,1,0,0,7,3,"Nível 3","3.0.1.",null,null,"PLATIBANDA",{"$f":"Referencia.Unidade","v":""},{"$f":"OFFSET(PLQ!$E$12,ROW($P138)-ROW(P$12),0)","v":0},null,"BDI 1",0,82649.47,"",{"$f":"IF(OR($A138=0,$A138=\"S\",$A138>CFF!$A$9),\"\",MAX(V$12:OFFSET(V138,-1,0))+1)","v":""},false,{"$f":"IF(AND(Fonte<>\"\",Código<>\"\"),MATCH(Fonte&\" \"&IF(Fonte=\"sinapi\",SUBSTITUTE(SUBSTITUTE(Código,\"/00\",\"/\"),\"/0\",\"/\"),Código),INDIRECT(\"'[Referência \"&_xlnm.Database&\".xls]Banco'!$a:$a\"),0),\"X\")","v":"X"},{"$f":"IF(Import.Desoneracao=\"sim\",Referencia.Desonerado,Referencia.NaoDesonerado)","v":0},{"$f":"ROUND(IF(ISNUMBER(R138),R138,IF(LEFT(R138,3)=\"BDI\",HLOOKUP(R138,DADOS!$T$37:$X$38,2,FALSE),0)),15-11*$X$5)","v":0.30209999999999998}]
["S",0,3,0,1,0,1,0,0,"Serviço","3.0.1.0.1.","COTAÇÃO","RCV04","FACHADA - ACM 3MM (PLATIBANDA, SACADA E DETALHE LATERAL), INCLUSO TESTEIRAS E ESTRUTURA METÁLICA NECESSÁRIA - FORNECIMENTO E INSTALAÇÃO","M2",{"$f":"OFFSET(PLQ!$E$12,ROW($P139)-ROW(P$12),0)","v":178.56},{"$f":"Y139/1.3021","v":315.53767834136761},"BDI 1",410.86,73363.16,"",{"$f":"IF(OR($A139=0,$A139=\"S\",$A139>CFF!$A$9),\"\",MAX(V$12:OFFSET(V139,-1,0))+1)","v":""},"COTAÇÃO-RCV04",20,{"$f":"IF(Import.Desoneracao=\"sim\",Referencia.Desonerado,Referencia.NaoDesonerado)","v":410.86161096829477},{"$f":"ROUND(IF(ISNUMBER(R139),R139,IF(LEFT(R139,3)=\"BDI\",HLOOKUP(R139,DADOS!$T$37:$X$38,2,FALSE),0)),15-11*$X$5)","v":0.30209999999999998}]
[{"$f":"CHOOSE(1+LOG(1+2*(J140=\"Meta\")+4*(J140=\"Nível 2\")+8*(J140=\"Nível 3\")+16*(J140=\"Nível 4\")+32*(J140=\"Serviço\"),2),0,1,2,3,4,\"S\")","v":"S"},{"$f":"IF(OR(A140=\"S\",A140=0),0,IF(ISERROR(I140),H140,SMALL(H140:I140,1)))","v":0},3,0,1,0,2,0,0,"Serviço","3.0.1.0.2.","SINAPI","94213","TELHAMENTO COM TELHA DE AÇO/ALUMÍNIO E = 0,5 MM, COM ATÉ 2 ÁGUAS, INCLUSO IÇAMENTO. AF_07/2019","M2",{"$f":"OFFSET(PLQ!$E$12,ROW($P140)-ROW(P$12),0)","v":119.04},59.91,"BDI 1",78.010000000000005,9286.31,"",{"$f":"IF(OR($A140=0,$A140=\"S\",$A140>CFF!$A$9),\"\",MAX(V$12:OFFSET(V140,-1,0))+1)","v":""},"SINAPI-94213",15078,{"$f":"IF(Import.Desoneracao=\"sim\",Referencia.Desonerado,Referencia.NaoDesonerado)","v":59.91},{"$f":"ROUND(IF(ISNUMBER(R140),R140,IF(LEFT(R140,3)=\"BDI\",HLOOKUP(R140,DADOS!$T$37:$X$38,2,FALSE),0)),15-11*$X$5)","v":0.30209999999999998}]
[{"$f":"CHOOSE(1+LOG(1+2*(J141=\"Meta\")+4*(J141=\"Nível 2\")+8*(J141=\"Nível 3\")+16*(J141=\"Nível 4\")+32*(J141=\"Serviço\"),2),0,1,2,3,4,\"S\")","v":3},{"$f":"IF(OR(A141=\"S\",A141=0),0,IF(ISERROR(I141),H141,SMALL(H141:I141,1)))","v":2},3,0,2,0,0,4,2,"Nível 3","3.0.2.",null,null,"SACADA",{"$f":"Referencia.Unidade","v":""},{"$f":"OFFSET(PLQ!$E$12,ROW($P141)-ROW(P$12),0)","v":0},null,"BDI 1",0,9277.2199999999993,"",{"$f":"IF(OR($A141=0,$A141=\"S\",$A141>CFF!$A$9),\"\",MAX(V$12:OFFSET(V141,-1,0))+1)","v":""},false,"X",{"$f":"IF(Import.Desoneracao=\"sim\",Referencia.Desonerado,Referencia.NaoDesonerado)","v":0},{"$f":"ROUND(IF(ISNUMBER(R141),R141,IF(LEFT(R141,3)=\"BDI\",HLOOKUP(R141,DADOS!$T$37:$X$38,2,FALSE),0)),15-11*$X$5)","v":0.30209999999999998}]
["S",0,3,0,2,0,1,0,0,"Serviço","3.0.2.0.1.","COTAÇÃO","RCV04","FACHADA - ACM 3MM (PLATIBANDA, SACADA E DETALHE LATERAL), INCLUSO TESTEIRAS E ESTRUTURA METÁLICA NECESSÁRIA - FORNECIMENTO E INSTALAÇÃO","M2",{"$f":"OFFSET(PLQ!$E$12,ROW($P142)-ROW(P$12),0)","v":22.58},{"$f":"Y142/1.3021","v":315.53767834136761},"BDI 1",410.86,9277.2199999999993,"",{"$f":"IF(OR($A142=0,$A142=\"S\",$A142>CFF!$A$9),\"\",MAX(V$12:OFFSET(V142,-1,0))+1)","v":""},"COTAÇÃO-RCV04",20,{"$f":"IF(Import.Desoneracao=\"sim\",Referencia.Desonerado,Referencia.NaoDesonerado)","v":410.86161096829477},{"$f":"ROUND(IF(ISNUMBER(R142),R142,IF(LEFT(R142,3)=\"BDI\",HLOOKUP(R142,DADOS!$T$37:$X$38,2,FALSE),0)),15-11*$X$5)","v":0.30209999999999998}]
[3,2,3,0,3,0,0,2,{"$error":"#N/A"},"Nível 3","3.0.3.",null,null,"DETALHE LATERAL",{"$f":"Referencia.Unidade","v":""},{"$f":"OFFSET(PLQ!$E$12,ROW($P143)-ROW(P$12),0)","v":0},null,"BDI 1",0,11504.08,"",{"$f":"IF(OR($A143=0,$A143=\"S\",$A143>CFF!$A$9),\"\",MAX(V$12:OFFSET(V143,-1,0))+1)","v":""},false,"X",{"$f":"IF(Import.Desoneracao=\"sim\",Referencia.Desonerado,Referencia.NaoDesonerado)","v":0},{"$f":"ROUND(IF(ISNUMBER(R143),R143,IF(LEFT(R143,3)=\"BDI\",HLOOKUP(R143,DADOS!$T$37:$X$38,2,FALSE),0)),15-11*$X$5)","v":0.30209999999999998}]
["S",0,3,0,3,0,1,0,0,"Serviço","3.0.3.0.1.","COTAÇÃO","RCV04","FACHADA - ACM 3MM (PLATIBANDA, SACADA E DETALHE LATERAL), INCLUSO TESTEIRAS E ESTRUTURA METÁLICA NECESSÁRIA - FORNECIMENTO E INSTALAÇÃO","M2",{"$f":"OFFSET(PLQ!$E$12,ROW($P144)-ROW(P$12),0)","v":28},{"$f":"Y144/1.3021","v":315.53767834136761},"BDI 1",410.86,11504.08,"",{"$f":"IF(OR($A144=0,$A144=\"S\",$A144>CFF!$A$9),\"\",MAX(V$12:OFFSET(V144,-1,0))+1)","v":""},"COTAÇÃO-RCV04",20,{"$f":"IF(Import.Desoneracao=\"sim\",Referencia.Desonerado,Referencia.NaoDesonerado)","v":410.86161096829477},{"$f":"ROUND(IF(ISNUMBER(R144),R144,IF(LEFT(R144,3)=\"BDI\",HLOOKUP(R144,DADOS!$T$37:$X$38,2,FALSE),0)),15-11*$X$5)","v":0.30209999999999998}]
[-1,null,0,0,0,0,0]
[null,null,null,null,null,null,null,null,null,null,"Encargos sociais:",null,"Para elaboração deste orçamento, foram utilizados os encargos sociais do SINAPI para a Unidade da Federação indicada."]
[]
[null,null,null,null,null,null,null,null,null,null,"Observações:"]
[]
[]
[]
[]
[null,null,null,null,null,null,null,null,null,null,{"$f":"IF(AND($X$3=FALSE,$X$4=FALSE,$X$5=FALSE,$X$6=FALSE,$X$7=FALSE),\"Não foi considerado arredondamento nos valores da planilha.\",CONCATENATE(\"Foi considerado arredondamento de duas casas decimais para \",IF($X$3=TRUE,\"Quantidade; \",\"\"),IF($X$4=TRUE,\"Custo Unitário; \",\"\"),IF($X$5=TRUE,\"BDI; \",\"\"),IF($X$6=TRUE,\"Preço Unitário; \",\"\"),IF($X$7=TRUE,\"Preço Total.\",\"\")))","v":"Foi considerado arredondamento de duas casas decimais para Quantidade; Custo Unitário; BDI; Preço Unitário; Preço Total."}]
[]
[]
[null,null,null,null,null,null,null,null,null,null,{"$f":"Import.Município","v":"SÃO JOSÉ DO OURO / RS"}]
[null,null,null,null,null,null,null,null,null,null,"Local"]
[]
[null,null,null,null,null,null,null,null,null,null,{"$f":"TODAY()","v":"2025-11-02"}]
[null,null,null,null,null,null,null,null,null,null,"Data"]

{"sheet":"PLQ","index":6,"n_rows":151,"n_cols":21,"rows_kept":151,"cut":false,"hidden":false,"merged":[[146,1,146,2],[149,1,149,2]]}
[null,null,null,null,"PLQ -","PLANILHA DE LEVANTAMENTO DE QUANTIDADES"]
[]
[]
[]
[]
[]
[null,null,null,null,{"$f":"OFFSET(PO!$P$12,ROW($E7)-ROW(E$12),0)","v":0}]
[]
[null,null,null,null,"-","Única","Térreo","2º Pav"]
["Nível","Item","Descrição","Unid.","Quantidade",{"$f":"IF(OFFSET(F10,0,-1)=\"Quantidade\",1,OFFSET(F10,0,-1)+1)","v":1},2,3,4,5,6,7,8,9,10,null,null,null,null,null,{"$f":"IF(OFFSET(U10,0,-1)=\"Quantidade\",1,OFFSET(U10,0,-1)+1)","v":1}]
[{"$f":"OFFSET(PO!J$12,ROW(A11)-ROW($A$12),0)","v":"Serviço"},{"$f":"IF($A11=0,\"\",OFFSET(PO!K$12,ROW(B11)-ROW(B$12),0))","v":{"$error":"#VALUE!"}},{"$f":"IF(OFFSET(PO!N$12,ROW(C11)-ROW(C$12),0)=0,\"\",OFFSET(PO!N$12,ROW(C11)-ROW(C$12),0))","v":""},{"$f":"IF(OFFSET(PO!O$12,ROW(D11)-ROW(D$12),0)=0,\"\",OFFSET(PO!O$12,ROW(D11)-ROW(D$12),0))","v":""},{"$f":"IF($A11<>\"Serviço\",0,ROUND(SUMIF($F$9:$P$9,\"<>\",$F11:$P11),15-13*PO!$X$3))","v":0}]
[{"$f":"PO!J12","v":"LOTE"},null,{"$f":"PO!N12","v":"REFORMA DA CÂMARA DE VEREADORES DE SÃO JOSÉ DO OURO"}]
[{"$f":"OFFSET(PO!J$12,ROW(A13)-ROW($A$12),0)","v":"Meta"},{"$f":"IF($A13=0,\"\",OFFSET(PO!K$12,ROW(B13)-ROW(B$12),0))","v":"1."},{"$f":"IF(OFFSET(PO!N$12,ROW(C13)-ROW(C$12),0)=0,\"\",OFFSET(PO!N$12,ROW(C13)-ROW(C$12),0))","v":"LOTE 1 - 1ª ETAPA DA REFORMA"},{"$f":"IF(OFFSET(PO!O$12,ROW(D13)-ROW(D$12),0)=0,\"\",OFFSET(PO!O$12,ROW(D13)-ROW(D$12),0))","v":""},{"$f":"IF($A13<>\"Serviço\",0,ROUND(SUMIF($F$9:$P$9,\"<>\",$F13:$P13),15-13*PO!$X$3))","v":0},0]
[{"$f":"OFFSET(PO!J$12,ROW(A14)-ROW($A$12),0)","v":"Nível 2"},{"$f":"IF($A14=0,\"\",OFFSET(PO!K$12,ROW(B14)-ROW(B$12),0))","v":"1.1."},{"$f":"IF(OFFSET(PO!N$12,ROW(C14)-ROW(C$12),0)=0,\"\",OFFSET(PO!N$12,ROW(C14)-ROW(C$12),0))","v":"SERVIÇOS INICIAIS"},{"$f":"IF(OFFSET(PO!O$12,ROW(D14)-ROW(D$12),0)=0,\"\",OFFSET(PO!O$12,ROW(D14)-ROW(D$12),0))","v":""},{"$f":"IF($A14<>\"Serviço\",0,ROUND(SUMIF($F$9:$P$9,\"<>\",$F14:$P14),15-13*PO!$X$3))","v":0},0]
[{"$f":"OFFSET(PO!J$12,ROW(A15)-ROW($A$12),0)","v":"Serviço"},{"$f":"IF($A15=0,\"\",OFFSET(PO!K$12,ROW(B15)-ROW(B$12),0))","v":"1.1.0.0.1."},{"$f":"IF(OFFSET(PO!N$12,ROW(C15)-ROW(C$12),0)=0,\"\",OFFSET(PO!N$12,ROW(C15)-ROW(C$12),0))","v":"ADMINSTRAÇÃO LOCAL "},{"$f":"IF(OFFSET(PO!O$12,ROW(D15)-ROW(D$12),0)=0,\"\",OFFSET(PO!O$12,ROW(D15)-ROW(D$12),0))","v":"MÊS"},{"$f":"IF($A15<>\"Serviço\",0,ROUND(SUMIF($F$9:$P$9,\"<>\",$F15:$P15),15-13*PO!$X$3))","v":2},2]
[{"$f":"OFFSET(PO!J$12,ROW(A16)-ROW($A$12),0)","v":"Serviço"},{"$f":"IF($A16=0,\"\",OFFSET(PO!K$12,ROW(B16)-ROW(B$12),0))","v":"1.1.0.0.2."},{"$f":"IF(OFFSET(PO!N$12,ROW(C16)-ROW(C$12),0)=0,\"\",OFFSET(PO!N$12,ROW(C16)-ROW(C$12),0))","v":"FORNECIMENTO E INSTALAÇÃO DE PLACA DE OBRA COM CHAPA GALVANIZADA E ESTRUTURA DE MADEIRA. AF_03/2022_PS"},{"$f":"IF(OFFSET(PO!O$12,ROW(D16)-ROW(D$12),0)=0,\"\",OFFSET(PO!O$12,ROW(D16)-ROW(D$12),0))","v":"M2"},{"$f":"IF($A16<>\"Serviço\",0,ROUND(SUMIF($F$9:$P$9,\"<>\",$F16:$P16),15-13*PO!$X$3))","v":2.4},2.4]
[{"$f":"OFFSET(PO!J$12,ROW(A17)-ROW($A$12),0)","v":"Serviço"},{"$f":"IF($A17=0,\"\",OFFSET(PO!K$12,ROW(B17)-ROW(B$12),0))","v":"1.1.0.0.3."},{"$f":"IF(OFFSET(PO!N$12,ROW(C17)-ROW(C$12),0)=0,\"\",OFFSET(PO!N$12,ROW(C17)-ROW(C$12),0))","v":"LOCACAO DE ANDAIME METALICO TIPO FACHADEIRO, PECAS COM APROXIMADAMENTE 1,20 M DE LARGURA E 2,0 M DE ALTURA, INCLUINDO DIAGONAIS EM X, BARRAS DE LIGACAO, SAPATAS E DEMAIS ITENS NECESSARIOS A MONTAGEM (NAO INCLUI INSTALACAO)"},{"$f":"IF(OFFSET(PO!O$12,ROW(D17)-ROW(D$12),0)=0,\"\",OFFSET(PO!O$12,ROW(D17)-ROW(D$12),0))","v":"M2XMES"},{"$f":"IF($A17<>\"Serviço\",0,ROUND(SUMIF($F$9:$P$9,\"<>\",$F17:$P17),15-13*PO!$X$3))","v":8},8]
[{"$f":"OFFSET(PO!J$12,ROW(A18)-ROW($A$12),0)","v":"Nível 2"},{"$f":"IF($A18=0,\"\",OFFSET(PO!K$12,ROW(B18)-ROW(B$12),0))","v":"1.2."},{"$f":"IF(OFFSET(PO!N$12,ROW(C18)-ROW(C$12),0)=0,\"\",OFFSET(PO!N$12,ROW(C18)-ROW(C$12),0))","v":"COBERTURA E PLATATIBANDA"},{"$f":"IF(OFFSET(PO!O$12,ROW(D18)-ROW(D$12),0)=0,\"\",OFFSET(PO!O$12,ROW(D18)-ROW(D$12),0))","v":""},{"$f":"IF($A18<>\"Serviço\",0,ROUND(SUMIF($F$9:$P$9,\"<>\",$F18:$P18),15-13*PO!$X$3))","v":0},0]
[{"$f":"OFFSET(PO!J$12,ROW(A19)-ROW($A$12),0)","v":"Nível 3"},{"$f":"IF($A19=0,\"\",OFFSET(PO!K$12,ROW(B19)-ROW(B$12),0))","v":"1.2.1."},{"$f":"IF(OFFSET(PO!N$12,ROW(C19)-ROW(C$12),0)=0,\"\",OFFSET(PO!N$12,ROW(C19)-ROW(C$12),0))","v":"DEMOLIÇÕES E REMOÇÕES"},{"$f":"IF(OFFSET(PO!O$12,ROW(D19)-ROW(D$12),0)=0,\"\",OFFSET(PO!O$12,ROW(D19)-ROW(D$12),0))","v":""},{"$f":"IF($A19<>\"Serviço\",0,ROUND(SUMIF($F$9:$P$9,\"<>\",$F19:$P19),15-13*PO!$X$3))","v":0}]
[{"$f":"OFFSET(PO!J$12,ROW(A20)-ROW($A$12),0)","v":"Serviço"},{"$f":"IF($A20=0,\"\",OFFSET(PO!K$12,ROW(B20)-ROW(B$12),0))","v":"1.2.1.0.1."},{"$f":"IF(OFFSET(PO!N$12,ROW(C20)-ROW(C$12),0)=0,\"\",OFFSET(PO!N$12,ROW(C20)-ROW(C$12),0))","v":"REMOÇÃO CALHAS E RUFOS, DE FORMA MANUAL, SEM REAPROVEITAMENTO. AF_09/2023"},{"$f":"IF(OFFSET(PO!O$12,ROW(D20)-ROW(D$12),0)=0,\"\",OFFSET(PO!O$12,ROW(D20)-ROW(D$12),0))","v":"M"},{"$f":"IF($A20<>\"Serviço\",0,ROUND(SUMIF($F$9:$P$9,\"<>\",$F20:$P20),15-13*PO!$X$3))","v":120.4},{"$f":"73.7+46.7","v":120.4}]
[{"$f":"OFFSET(PO!J$12,ROW(A21)-ROW($A$12),0)","v":"Serviço"},{"$f":"IF($A21=0,\"\",OFFSET(PO!K$12,ROW(B21)-ROW(B$12),0))","v":"1.2.1.0.2."},{"$f":"IF(OFFSET(PO!N$12,ROW(C21)-ROW(C$12),0)=0,\"\",OFFSET(PO!N$12,ROW(C21)-ROW(C$12),0))","v":"GUINDAUTO HIDRÁULICO, CAPACIDADE MÁXIMA DE CARGA 3300 KG, MOMENTO MÁXIMO DE CARGA 5,8 TM, ALCANCE MÁXIMO HORIZONTAL 7,60 M, INCLUSIVE CAMINHÃO TOCO PBT 16.000 KG, POTÊNCIA DE 189 CV - CHP DIURNO. AF_03/2016"},{"$f":"IF(OFFSET(PO!O$12,ROW(D21)-ROW(D$12),0)=0,\"\",OFFSET(PO!O$12,ROW(D21)-ROW(D$12),0))","v":"CHP"},{"$f":"IF($A21<>\"Serviço\",0,ROUND(SUMIF($F$9:$P$9,\"<>\",$F21:$P21),15-13*PO!$X$3))","v":3},3]
[{"$f":"OFFSET(PO!J$12,ROW(A22)-ROW($A$12),0)","v":"Serviço"},{"$f":"IF($A22=0,\"\",OFFSET(PO!K$12,ROW(B22)-ROW(B$12),0))","v":"1.2.1.0.3."},{"$f":"IF(OFFSET(PO!N$12,ROW(C22)-ROW(C$12),0)=0,\"\",OFFSET(PO!N$12,ROW(C22)-ROW(C$12),0))","v":"REMOÇÃO DE TELHAS DE FIBROCIMENTO METÁLICA E CERÂMICA, DE FORMA MANUAL, SEM REAPROVEITAMENTO. AF_09/2023"},{"$f":"IF(OFFSET(PO!O$12,ROW(D22)-ROW(D$12),0)=0,\"\",OFFSET(PO!O$12,ROW(D22)-ROW(D$12),0))","v":"M2"},{"$f":"IF($A22<>\"Serviço\",0,ROUND(SUMIF($F$9:$P$9,\"<>\",$F22:$P22),15-13*PO!$X$3))","v":278.14},278.14]
[{"$f":"OFFSET(PO!J$12,ROW(A23)-ROW($A$12),0)","v":"Serviço"},{"$f":"IF($A23=0,\"\",OFFSET(PO!K$12,ROW(B23)-ROW(B$12),0))","v":"1.2.1.0.4."},{"$f":"IF(OFFSET(PO!N$12,ROW(C23)-ROW(C$12),0)=0,\"\",OFFSET(PO!N$12,ROW(C23)-ROW(C$12),0))","v":"DEMOLIÇÃO DE ALVENARIA DE BLOCO FURADO, DE FORMA MANUAL, SEM REAPROVEITAMENTO. AF_09/2023"},{"$f":"IF(OFFSET(PO!O$12,ROW(D23)-ROW(D$12),0)=0,\"\",OFFSET(PO!O$12,ROW(D23)-ROW(D$12),0))","v":"M3"},{"$f":"IF($A23<>\"Serviço\",0,ROUND(SUMIF($F$9:$P$9,\"<>\",$F23:$P23),15-13*PO!$X$3))","v":15.3},{"$f":"89.98*0.17","v":15.296600000000002}]
[{"$f":"OFFSET(PO!J$12,ROW(A24)-ROW($A$12),0)","v":"Serviço"},{"$f":"IF($A24=0,\"\",OFFSET(PO!K$12,ROW(B24)-ROW(B$12),0))","v":"1.2.1.0.5."},{"$f":"IF(OFFSET(PO!N$12,ROW(C24)-ROW(C$12),0)=0,\"\",OFFSET(PO!N$12,ROW(C24)-ROW(C$12),0))","v":"TRANSPORTE HORIZONTAL MANUAL, DE BLOCOS CERÂMICOS FURADOS NA HORIZONTAL DE 9X19X19CM (UNIDADE: BLOCOXKM). AF_07/2019"},{"$f":"IF(OFFSET(PO!O$12,ROW(D24)-ROW(D$12),0)=0,\"\",OFFSET(PO!O$12,ROW(D24)-ROW(D$12),0))","v":"UNXKM"},{"$f":"IF($A24<>\"Serviço\",0,ROUND(SUMIF($F$9:$P$9,\"<>\",$F24:$P24),15-13*PO!$X$3))","v":84.7},{"$f":"(25/1000)*F25","v":84.7}]
[{"$f":"OFFSET(PO!J$12,ROW(A25)-ROW($A$12),0)","v":"Serviço"},{"$f":"IF($A25=0,\"\",OFFSET(PO!K$12,ROW(B25)-ROW(B$12),0))","v":"1.2.1.0.6."},{"$f":"IF(OFFSET(PO!N$12,ROW(C25)-ROW(C$12),0)=0,\"\",OFFSET(PO!N$12,ROW(C25)-ROW(C$12),0))","v":"TRANSPORTE VERTICAL MANUAL, 1 PAVIMENTO, DE BLOCOS CERÂMICOS FURADOS NA HORIZONTAL DE 9X19X19CM (UNIDADE: BLOCO). AF_07/2019"},{"$f":"IF(OFFSET(PO!O$12,ROW(D25)-ROW(D$12),0)=0,\"\",OFFSET(PO!O$12,ROW(D25)-ROW(D$12),0))","v":"UN"},{"$f":"IF($A25<>\"Serviço\",0,ROUND(SUMIF($F$9:$P$9,\"<>\",$F25:$P25),15-13*PO!$X$3))","v":3388},{"$f":"(77*1.1)*40","v":3388}]
[{"$f":"OFFSET(PO!J$12,ROW(A26)-ROW($A$12),0)","v":"Nível 3"},{"$f":"IF($A26=0,\"\",OFFSET(PO!K$12,ROW(B26)-ROW(B$12),0))","v":"1.2.2."},{"$f":"IF(OFFSET(PO!N$12,ROW(C26)-ROW(C$12),0)=0,\"\",OFFSET(PO!N$12,ROW(C26)-ROW(C$12),0))","v":"EXECUÇÃO DA COBERTURA"},{"$f":"IF(OFFSET(PO!O$12,ROW(D26)-ROW(D$12),0)=0,\"\",OFFSET(PO!O$12,ROW(D26)-ROW(D$12),0))","v":""},{"$f":"IF($A26<>\"Serviço\",0,ROUND(SUMIF($F$9:$P$9,\"<>\",$F26:$P26),15-13*PO!$X$3))","v":0}]
[{"$f":"OFFSET(PO!J$12,ROW(A27)-ROW($A$12),0)","v":"Serviço"},{"$f":"IF($A27=0,\"\",OFFSET(PO!K$12,ROW(B27)-ROW(B$12),0))","v":"1.2.2.0.1."},{"$f":"IF(OFFSET(PO!N$12,ROW(C27)-ROW(C$12),0)=0,\"\",OFFSET(PO!N$12,ROW(C27)-ROW(C$12),0))","v":"PROLONGAMENTO DE 0,50M DE TRELIÇA METÁLICA (PERFIL U 75X38 #3,00MM) - FORNECIMENTO E INSTALAÇÃO "},{"$f":"IF(OFFSET(PO!O$12,ROW(D27)-ROW(D$12),0)=0,\"\",OFFSET(PO!O$12,ROW(D27)-ROW(D$12),0))","v":"UN "},{"$f":"IF($A27<>\"Serviço\",0,ROUND(SUMIF($F$9:$P$9,\"<>\",$F27:$P27),15-13*PO!$X$3))","v":18},18]
[{"$f":"OFFSET(PO!J$12,ROW(A28)-ROW($A$12),0)","v":"Serviço"},{"$f":"IF($A28=0,\"\",OFFSET(PO!K$12,ROW(B28)-ROW(B$12),0))","v":"1.2.2.0.2."},{"$f":"IF(OFFSET(PO!N$12,ROW(C28)-ROW(C$12),0)=0,\"\",OFFSET(PO!N$12,ROW(C28)-ROW(C$12),0))","v":"TRAMA DE AÇO COMPOSTA POR TERÇAS PARA TELHADOS DE ATÉ 2 ÁGUAS PARA TELHA ONDULADA DE FIBROCIMENTO, METÁLICA, PLÁSTICA OU TERMOACÚSTICA, INCLUSO TRANSPORTE VERTICAL. AF_07/2019"},{"$f":"IF(OFFSET(PO!O$12,ROW(D28)-ROW(D$12),0)=0,\"\",OFFSET(PO!O$12,ROW(D28)-ROW(D$12),0))","v":"M2"},{"$f":"IF($A28<>\"Serviço\",0,ROUND(SUMIF($F$9:$P$9,\"<>\",$F28:$P28),15-13*PO!$X$3))","v":67.459999999999994},{"$f":"79.36*0.85","v":67.456000000000003}]
[{"$f":"OFFSET(PO!J$12,ROW(A29)-ROW($A$12),0)","v":"Serviço"},{"$f":"IF($A29=0,\"\",OFFSET(PO!K$12,ROW(B29)-ROW(B$12),0))","v":"1.2.2.0.3."},{"$f":"IF(OFFSET(PO!N$12,ROW(C29)-ROW(C$12),0)=0,\"\",OFFSET(PO!N$12,ROW(C29)-ROW(C$12),0))","v":"TELHAMENTO COM TELHA TERMOISOLANTE EM AÇO GALVALUME 0,50MM, FACE SUPERIOR TRAPEZOIDAL E FACE INFERIOR PLANA, NÚCLEO EM POLIISOCIANUTO (PIR) 50MM, COM ATÉ 2 ÁGUAS, INCLUSO IÇAMENTO. AF_07/2019"},{"$f":"IF(OFFSET(PO!O$12,ROW(D29)-ROW(D$12),0)=0,\"\",OFFSET(PO!O$12,ROW(D29)-ROW(D$12),0))","v":"M2"},{"$f":"IF($A29<>\"Serviço\",0,ROUND(SUMIF($F$9:$P$9,\"<>\",$F29:$P29),15-13*PO!$X$3))","v":326.10000000000002},326.10000000000002]
[{"$f":"OFFSET(PO!J$12,ROW(A30)-ROW($A$12),0)","v":"Serviço"},{"$f":"IF($A30=0,\"\",OFFSET(PO!K$12,ROW(B30)-ROW(B$12),0))","v":"1.2.2.0.4."},{"$f":"IF(OFFSET(PO!N$12,ROW(C30)-ROW(C$12),0)=0,\"\",OFFSET(PO!N$12,ROW(C30)-ROW(C$12),0))","v":"CUMEEIRA NORMAL PARA TELHA TRAPEZOIDAL DE AÇO, E = 0,5 MM, INCLUSO ACESSÓRIOS DE FIXAÇÃO E IÇAMENTO. AF_07/2019"},{"$f":"IF(OFFSET(PO!O$12,ROW(D30)-ROW(D$12),0)=0,\"\",OFFSET(PO!O$12,ROW(D30)-ROW(D$12),0))","v":"M"},{"$f":"IF($A30<>\"Serviço\",0,ROUND(SUMIF($F$9:$P$9,\"<>\",$F30:$P30),15-13*PO!$X$3))","v":24.42},24.42]
[{"$f":"OFFSET(PO!J$12,ROW(A31)-ROW($A$12),0)","v":"Serviço"},{"$f":"IF($A31=0,\"\",OFFSET(PO!K$12,ROW(B31)-ROW(B$12),0))","v":"1.2.2.0.5."},{"$f":"IF(OFFSET(PO!N$12,ROW(C31)-ROW(C$12),0)=0,\"\",OFFSET(PO!N$12,ROW(C31)-ROW(C$12),0))","v":"CALHA EM CHAPA DE AÇO GALVANIZADO NÚMERO 24, DESENVOLVIMENTO DE 100 CM, INCLUSO TRANSPORTE VERTICAL. AF_07/2019"},{"$f":"IF(OFFSET(PO!O$12,ROW(D31)-ROW(D$12),0)=0,\"\",OFFSET(PO!O$12,ROW(D31)-ROW(D$12),0))","v":"M"},{"$f":"IF($A31<>\"Serviço\",0,ROUND(SUMIF($F$9:$P$9,\"<>\",$F31:$P31),15-13*PO!$X$3))","v":48.84},{"$f":"24.42*2","v":48.84}]
[{"$f":"OFFSET(PO!J$12,ROW(A32)-ROW($A$12),0)","v":"Serviço"},{"$f":"IF($A32=0,\"\",OFFSET(PO!K$12,ROW(B32)-ROW(B$12),0))","v":"1.2.2.0.6."},{"$f":"IF(OFFSET(PO!N$12,ROW(C32)-ROW(C$12),0)=0,\"\",OFFSET(PO!N$12,ROW(C32)-ROW(C$12),0))","v":"JOELHO 45 GRAUS, PVC, SERIE R, ÁGUA PLUVIAL, DN 100 MM, JUNTA ELÁSTICA, FORNECIDO E INSTALADO EM CONDUTORES VERTICAIS DE ÁGUAS PLUVIAIS. AF_06/2022"},{"$f":"IF(OFFSET(PO!O$12,ROW(D32)-ROW(D$12),0)=0,\"\",OFFSET(PO!O$12,ROW(D32)-ROW(D$12),0))","v":"UN"},{"$f":"IF($A32<>\"Serviço\",0,ROUND(SUMIF($F$9:$P$9,\"<>\",$F32:$P32),15-13*PO!$X$3))","v":16},16]
[{"$f":"OFFSET(PO!J$12,ROW(A33)-ROW($A$12),0)","v":"Serviço"},{"$f":"IF($A33=0,\"\",OFFSET(PO!K$12,ROW(B33)-ROW(B$12),0))","v":"1.2.2.0.7."},{"$f":"IF(OFFSET(PO!N$12,ROW(C33)-ROW(C$12),0)=0,\"\",OFFSET(PO!N$12,ROW(C33)-ROW(C$12),0))","v":"LUVA SIMPLES, PVC, SERIE R, ÁGUA PLUVIAL, DN 100 MM, JUNTA ELÁSTICA, FORNECIDO E INSTALADO EM CONDUTORES VERTICAIS DE ÁGUAS PLUVIAIS. AF_06/2022"},{"$f":"IF(OFFSET(PO!O$12,ROW(D33)-ROW(D$12),0)=0,\"\",OFFSET(PO!O$12,ROW(D33)-ROW(D$12),0))","v":"UN"},{"$f":"IF($A33<>\"Serviço\",0,ROUND(SUMIF($F$9:$P$9,\"<>\",$F33:$P33),15-13*PO!$X$3))","v":8},8]
[{"$f":"OFFSET(PO!J$12,ROW(A34)-ROW($A$12),0)","v":"Nível 2"},{"$f":"IF($A34=0,\"\",OFFSET(PO!K$12,ROW(B34)-ROW(B$12),0))","v":"1.3."},{"$f":"IF(OFFSET(PO!N$12,ROW(C34)-ROW(C$12),0)=0,\"\",OFFSET(PO!N$12,ROW(C34)-ROW(C$12),0))","v":"REMOÇÃO DOS REVESTIMENTOS"},{"$f":"IF(OFFSET(PO!O$12,ROW(D34)-ROW(D$12),0)=0,\"\",OFFSET(PO!O$12,ROW(D34)-ROW(D$12),0))","v":""},{"$f":"IF($A34<>\"Serviço\",0,ROUND(SUMIF($F$9:$P$9,\"<>\",$F34:$P34),15-13*PO!$X$3))","v":0}]
[{"$f":"OFFSET(PO!J$12,ROW(A35)-ROW($A$12),0)","v":"Nível 3"},{"$f":"IF($A35=0,\"\",OFFSET(PO!K$12,ROW(B35)-ROW(B$12),0))","v":"1.3.1."},{"$f":"IF(OFFSET(PO!N$12,ROW(C35)-ROW(C$12),0)=0,\"\",OFFSET(PO!N$12,ROW(C35)-ROW(C$12),0))","v":"PAREDE"},{"$f":"IF(OFFSET(PO!O$12,ROW(D35)-ROW(D$12),0)=0,\"\",OFFSET(PO!O$12,ROW(D35)-ROW(D$12),0))","v":""},{"$f":"IF($A35<>\"Serviço\",0,ROUND(SUMIF($F$9:$P$9,\"<>\",$F35:$P35),15-13*PO!$X$3))","v":0}]
[{"$f":"OFFSET(PO!J$12,ROW(A36)-ROW($A$12),0)","v":"Nível 4"},{"$f":"IF($A36=0,\"\",OFFSET(PO!K$12,ROW(B36)-ROW(B$12),0))","v":"1.3.1.1."},{"$f":"IF(OFFSET(PO!N$12,ROW(C36)-ROW(C$12),0)=0,\"\",OFFSET(PO!N$12,ROW(C36)-ROW(C$12),0))","v":"INTERNO"},{"$f":"IF(OFFSET(PO!O$12,ROW(D36)-ROW(D$12),0)=0,\"\",OFFSET(PO!O$12,ROW(D36)-ROW(D$12),0))","v":""},{"$f":"IF($A36<>\"Serviço\",0,ROUND(SUMIF($F$9:$P$9,\"<>\",$F36:$P36),15-13*PO!$X$3))","v":0}]
[{"$f":"OFFSET(PO!J$12,ROW(A37)-ROW($A$12),0)","v":"Serviço"},{"$f":"IF($A37=0,\"\",OFFSET(PO!K$12,ROW(B37)-ROW(B$12),0))","v":"1.3.1.1.1."},{"$f":"IF(OFFSET(PO!N$12,ROW(C37)-ROW(C$12),0)=0,\"\",OFFSET(PO!N$12,ROW(C37)-ROW(C$12),0))","v":"DEMOLIÇÃO DE ARGAMASSAS, DE FORMA MANUAL, SEM REAPROVEITAMENTO. AF_09/2023"},{"$f":"IF(OFFSET(PO!O$12,ROW(D37)-ROW(D$12),0)=0,\"\",OFFSET(PO!O$12,ROW(D37)-ROW(D$12),0))","v":"M2"},{"$f":"IF($A37<>\"Serviço\",0,ROUND(SUMIF($F$9:$P$9,\"<>\",$F37:$P37),15-13*PO!$X$3))","v":105.68},null,{"$f":"(1.8*1)+((9.82*3.5)-(1.5*0.63*2))","v":34.28},{"$f":"(((8.32+6.45)*2.35)-(1.5*0.6*3))+(9.82*1.5)+((7.49*3.5)-(1.55*1))","v":71.404499999999985}]
[{"$f":"OFFSET(PO!J$12,ROW(A38)-ROW($A$12),0)","v":"Serviço"},{"$f":"IF($A38=0,\"\",OFFSET(PO!K$12,ROW(B38)-ROW(B$12),0))","v":"1.3.1.1.2."},{"$f":"IF(OFFSET(PO!N$12,ROW(C38)-ROW(C$12),0)=0,\"\",OFFSET(PO!N$12,ROW(C38)-ROW(C$12),0))","v":"DEMOLIÇÃO DE REVESTIMENTO CERÂMICO, DE FORMA MECANIZADA COM MARTELETE, SEM REAPROVEITAMENTO. AF_09/2023"},{"$f":"IF(OFFSET(PO!O$12,ROW(D38)-ROW(D$12),0)=0,\"\",OFFSET(PO!O$12,ROW(D38)-ROW(D$12),0))","v":"M2"},{"$f":"IF($A38<>\"Serviço\",0,ROUND(SUMIF($F$9:$P$9,\"<>\",$F38:$P38),15-13*PO!$X$3))","v":22.33},null,null,{"$f":"(6.8*3.5)-(0.7*2.1)","v":22.330000000000002}]
[{"$f":"OFFSET(PO!J$12,ROW(A39)-ROW($A$12),0)","v":"Serviço"},{"$f":"IF($A39=0,\"\",OFFSET(PO!K$12,ROW(B39)-ROW(B$12),0))","v":"1.3.1.1.3."},{"$f":"IF(OFFSET(PO!N$12,ROW(C39)-ROW(C$12),0)=0,\"\",OFFSET(PO!N$12,ROW(C39)-ROW(C$12),0))","v":"REMOÇÃO DE PAINEL EM GRANITO COM REAPROVEITAMENTO"},{"$f":"IF(OFFSET(PO!O$12,ROW(D39)-ROW(D$12),0)=0,\"\",OFFSET(PO!O$12,ROW(D39)-ROW(D$12),0))","v":"M2"},{"$f":"IF($A39<>\"Serviço\",0,ROUND(SUMIF($F$9:$P$9,\"<>\",$F39:$P39),15-13*PO!$X$3))","v":9},{"$f":"3*3","v":9}]
[{"$f":"OFFSET(PO!J$12,ROW(A40)-ROW($A$12),0)","v":"Serviço"},{"$f":"IF($A40=0,\"\",OFFSET(PO!K$12,ROW(B40)-ROW(B$12),0))","v":"1.3.1.1.4."},{"$f":"IF(OFFSET(PO!N$12,ROW(C40)-ROW(C$12),0)=0,\"\",OFFSET(PO!N$12,ROW(C40)-ROW(C$12),0))","v":"TRANSPORTE MANUAL DE REVESTIMENTOS ARGAMASSADOS REMOVIDOS COM CARRINHO DE MÃO 45L - INCLUSO CARGA E DESCARGA"},{"$f":"IF(OFFSET(PO!O$12,ROW(D40)-ROW(D$12),0)=0,\"\",OFFSET(PO!O$12,ROW(D40)-ROW(D$12),0))","v":"M3XKM"},{"$f":"IF($A40<>\"Serviço\",0,ROUND(SUMIF($F$9:$P$9,\"<>\",$F40:$P40),15-13*PO!$X$3))","v":0.08},{"$f":"(25/1000)*((G37+H37)*0.03)","v":7.9263374999999997E-2}]
[{"$f":"OFFSET(PO!J$12,ROW(A41)-ROW($A$12),0)","v":"Nível 4"},{"$f":"IF($A41=0,\"\",OFFSET(PO!K$12,ROW(B41)-ROW(B$12),0))","v":"1.3.1.2."},{"$f":"IF(OFFSET(PO!N$12,ROW(C41)-ROW(C$12),0)=0,\"\",OFFSET(PO!N$12,ROW(C41)-ROW(C$12),0))","v":"EXTERNO"},{"$f":"IF(OFFSET(PO!O$12,ROW(D41)-ROW(D$12),0)=0,\"\",OFFSET(PO!O$12,ROW(D41)-ROW(D$12),0))","v":""},{"$f":"IF($A41<>\"Serviço\",0,ROUND(SUMIF($F$9:$P$9,\"<>\",$F41:$P41),15-13*PO!$X$3))","v":0}]
[{"$f":"OFFSET(PO!J$12,ROW(A42)-ROW($A$12),0)","v":"Serviço"},{"$f":"IF($A42=0,\"\",OFFSET(PO!K$12,ROW(B42)-ROW(B$12),0))","v":"1.3.1.2.1."},{"$f":"IF(OFFSET(PO!N$12,ROW(C42)-ROW(C$12),0)=0,\"\",OFFSET(PO!N$12,ROW(C42)-ROW(C$12),0))","v":"DEMOLIÇÃO DE ARGAMASSAS, DE FORMA MANUAL, SEM REAPROVEITAMENTO. AF_09/2023"},{"$f":"IF(OFFSET(PO!O$12,ROW(D42)-ROW(D$12),0)=0,\"\",OFFSET(PO!O$12,ROW(D42)-ROW(D$12),0))","v":"M2"},{"$f":"IF($A42<>\"Serviço\",0,ROUND(SUMIF($F$9:$P$9,\"<>\",$F42:$P42),15-13*PO!$X$3))","v":137.4},null,{"$f":"((19.23*3.6)-(1.5*0.6*4))","v":65.628000000000014},{"$f":"(20.95*3.5)-(1.55*1)","v":71.775000000000006}]
[{"$f":"OFFSET(PO!J$12,ROW(A43)-ROW($A$12),0)","v":"Serviço"},{"$f":"IF($A43=0,\"\",OFFSET(PO!K$12,ROW(B43)-ROW(B$12),0))","v":"1.3.1.2.2."},{"$f":"IF(OFFSET(PO!N$12,ROW(C43)-ROW(C$12),0)=0,\"\",OFFSET(PO!N$12,ROW(C43)-ROW(C$12),0))","v":"TRANSPORTE MANUAL DE REVESTIMENTOS ARGAMASSADOS REMOVIDOS COM CARRINHO DE MÃO 45L - INCLUSO CARGA E DESCARGA"},{"$f":"IF(OFFSET(PO!O$12,ROW(D43)-ROW(D$12),0)=0,\"\",OFFSET(PO!O$12,ROW(D43)-ROW(D$12),0))","v":"M3XKM"},{"$f":"IF($A43<>\"Serviço\",0,ROUND(SUMIF($F$9:$P$9,\"<>\",$F43:$P43),15-13*PO!$X$3))","v":0.1},{"$f":"(25/1000)*((G42+H42)*0.03)","v":0.10305225000000001}]
[{"$f":"OFFSET(PO!J$12,ROW(A44)-ROW($A$12),0)","v":"Nível 3"},{"$f":"IF($A44=0,\"\",OFFSET(PO!K$12,ROW(B44)-ROW(B$12),0))","v":"1.3.2."},{"$f":"IF(OFFSET(PO!N$12,ROW(C44)-ROW(C$12),0)=0,\"\",OFFSET(PO!N$12,ROW(C44)-ROW(C$12),0))","v":"TETO"},{"$f":"IF(OFFSET(PO!O$12,ROW(D44)-ROW(D$12),0)=0,\"\",OFFSET(PO!O$12,ROW(D44)-ROW(D$12),0))","v":""},{"$f":"IF($A44<>\"Serviço\",0,ROUND(SUMIF($F$9:$P$9,\"<>\",$F44:$P44),15-13*PO!$X$3))","v":0}]
[{"$f":"OFFSET(PO!J$12,ROW(A45)-ROW($A$12),0)","v":"Nível 4"},{"$f":"IF($A45=0,\"\",OFFSET(PO!K$12,ROW(B45)-ROW(B$12),0))","v":"1.3.2.1."},{"$f":"IF(OFFSET(PO!N$12,ROW(C45)-ROW(C$12),0)=0,\"\",OFFSET(PO!N$12,ROW(C45)-ROW(C$12),0))","v":"INTERNO"},{"$f":"IF(OFFSET(PO!O$12,ROW(D45)-ROW(D$12),0)=0,\"\",OFFSET(PO!O$12,ROW(D45)-ROW(D$12),0))","v":""},{"$f":"IF($A45<>\"Serviço\",0,ROUND(SUMIF($F$9:$P$9,\"<>\",$F45:$P45),15-13*PO!$X$3))","v":0}]
[{"$f":"OFFSET(PO!J$12,ROW(A46)-ROW($A$12),0)","v":"Serviço"},{"$f":"IF($A46=0,\"\",OFFSET(PO!K$12,ROW(B46)-ROW(B$12),0))","v":"1.3.2.1.1."},{"$f":"IF(OFFSET(PO!N$12,ROW(C46)-ROW(C$12),0)=0,\"\",OFFSET(PO!N$12,ROW(C46)-ROW(C$12),0))","v":"DEMOLIÇÃO DE ARGAMASSAS, DE FORMA MANUAL, SEM REAPROVEITAMENTO. AF_09/2023"},{"$f":"IF(OFFSET(PO!O$12,ROW(D46)-ROW(D$12),0)=0,\"\",OFFSET(PO!O$12,ROW(D46)-ROW(D$12),0))","v":"M2"},{"$f":"IF($A46<>\"Serviço\",0,ROUND(SUMIF($F$9:$P$9,\"<>\",$F46:$P46),15-13*PO!$X$3))","v":74.400000000000006},null,{"$f":"48.82+25.58","v":74.400000000000006}]
[{"$f":"OFFSET(PO!J$12,ROW(A47)-ROW($A$12),0)","v":"Nível 4"},{"$f":"IF($A47=0,\"\",OFFSET(PO!K$12,ROW(B47)-ROW(B$12),0))","v":"1.3.2.2."},{"$f":"IF(OFFSET(PO!N$12,ROW(C47)-ROW(C$12),0)=0,\"\",OFFSET(PO!N$12,ROW(C47)-ROW(C$12),0))","v":"EXTERNO"},{"$f":"IF(OFFSET(PO!O$12,ROW(D47)-ROW(D$12),0)=0,\"\",OFFSET(PO!O$12,ROW(D47)-ROW(D$12),0))","v":""},{"$f":"IF($A47<>\"Serviço\",0,ROUND(SUMIF($F$9:$P$9,\"<>\",$F47:$P47),15-13*PO!$X$3))","v":0}]
[{"$f":"OFFSET(PO!J$12,ROW(A48)-ROW($A$12),0)","v":"Serviço"},{"$f":"IF($A48=0,\"\",OFFSET(PO!K$12,ROW(B48)-ROW(B$12),0))","v":"1.3.2.2.1."},{"$f":"IF(OFFSET(PO!N$12,ROW(C48)-ROW(C$12),0)=0,\"\",OFFSET(PO!N$12,ROW(C48)-ROW(C$12),0))","v":"DEMOLIÇÃO DE ARGAMASSAS, DE FORMA MANUAL, SEM REAPROVEITAMENTO. AF_09/2023"},{"$f":"IF(OFFSET(PO!O$12,ROW(D48)-ROW(D$12),0)=0,\"\",OFFSET(PO!O$12,ROW(D48)-ROW(D$12),0))","v":"M2"},{"$f":"IF($A48<>\"Serviço\",0,ROUND(SUMIF($F$9:$P$9,\"<>\",$F48:$P48),15-13*PO!$X$3))","v":36.450000000000003},null,26.89,9.56]
[{"$f":"OFFSET(PO!J$12,ROW(A49)-ROW($A$12),0)","v":"Nível 2"},{"$f":"IF($A49=0,\"\",OFFSET(PO!K$12,ROW(B49)-ROW(B$12),0))","v":"1.4."},{"$f":"IF(OFFSET(PO!N$12,ROW(C49)-ROW(C$12),0)=0,\"\",OFFSET(PO!N$12,ROW(C49)-ROW(C$12),0))","v":"SACADA"},{"$f":"IF(OFFSET(PO!O$12,ROW(D49)-ROW(D$12),0)=0,\"\",OFFSET(PO!O$12,ROW(D49)-ROW(D$12),0))","v":""},{"$f":"IF($A49<>\"Serviço\",0,ROUND(SUMIF($F$9:$P$9,\"<>\",$F49:$P49),15-13*PO!$X$3))","v":0}]
[{"$f":"OFFSET(PO!J$12,ROW(A50)-ROW($A$12),0)","v":"Serviço"},{"$f":"IF($A50=0,\"\",OFFSET(PO!K$12,ROW(B50)-ROW(B$12),0))","v":"1.4.0.0.1."},{"$f":"IF(OFFSET(PO!N$12,ROW(C50)-ROW(C$12),0)=0,\"\",OFFSET(PO!N$12,ROW(C50)-ROW(C$12),0))","v":"REMOÇÃO DE FORROS DE DRYWALL, PVC E FIBROMINERAL, DE FORMA MANUAL, SEM REAPROVEITAMENTO. AF_09/2023"},{"$f":"IF(OFFSET(PO!O$12,ROW(D50)-ROW(D$12),0)=0,\"\",OFFSET(PO!O$12,ROW(D50)-ROW(D$12),0))","v":"M2"},{"$f":"IF($A50<>\"Serviço\",0,ROUND(SUMIF($F$9:$P$9,\"<>\",$F50:$P50),15-13*PO!$X$3))","v":23},null,null,{"$f":"H61","v":23}]
[{"$f":"OFFSET(PO!J$12,ROW(A51)-ROW($A$12),0)","v":"Serviço"},{"$f":"IF($A51=0,\"\",OFFSET(PO!K$12,ROW(B51)-ROW(B$12),0))","v":"1.4.0.0.2."},{"$f":"IF(OFFSET(PO!N$12,ROW(C51)-ROW(C$12),0)=0,\"\",OFFSET(PO!N$12,ROW(C51)-ROW(C$12),0))","v":"DEMOLIÇÃO DE REVESTIMENTO CERÂMICO, DE FORMA MECANIZADA COM MARTELETE, SEM REAPROVEITAMENTO. AF_09/2023"},{"$f":"IF(OFFSET(PO!O$12,ROW(D51)-ROW(D$12),0)=0,\"\",OFFSET(PO!O$12,ROW(D51)-ROW(D$12),0))","v":"M2"},{"$f":"IF($A51<>\"Serviço\",0,ROUND(SUMIF($F$9:$P$9,\"<>\",$F51:$P51),15-13*PO!$X$3))","v":23},null,null,23]
[{"$f":"OFFSET(PO!J$12,ROW(A52)-ROW($A$12),0)","v":"Serviço"},{"$f":"IF($A52=0,\"\",OFFSET(PO!K$12,ROW(B52)-ROW(B$12),0))","v":"1.4.0.0.3."},{"$f":"IF(OFFSET(PO!N$12,ROW(C52)-ROW(C$12),0)=0,\"\",OFFSET(PO!N$12,ROW(C52)-ROW(C$12),0))","v":"DEMOLIÇÃO DE RODAPÉ CERÂMICO, DE FORMA MANUAL, SEM REAPROVEITAMENTO. AF_09/2023"},{"$f":"IF(OFFSET(PO!O$12,ROW(D52)-ROW(D$12),0)=0,\"\",OFFSET(PO!O$12,ROW(D52)-ROW(D$12),0))","v":"M"},{"$f":"IF($A52<>\"Serviço\",0,ROUND(SUMIF($F$9:$P$9,\"<>\",$F52:$P52),15-13*PO!$X$3))","v":24.74},null,null,24.74]
[{"$f":"OFFSET(PO!J$12,ROW(A53)-ROW($A$12),0)","v":"Serviço"},{"$f":"IF($A53=0,\"\",OFFSET(PO!K$12,ROW(B53)-ROW(B$12),0))","v":"1.4.0.0.4."},{"$f":"IF(OFFSET(PO!N$12,ROW(C53)-ROW(C$12),0)=0,\"\",OFFSET(PO!N$12,ROW(C53)-ROW(C$12),0))","v":"DEMOLIÇÃO DE ARGAMASSAS, DE FORMA MANUAL, SEM REAPROVEITAMENTO. AF_09/2023"},{"$f":"IF(OFFSET(PO!O$12,ROW(D53)-ROW(D$12),0)=0,\"\",OFFSET(PO!O$12,ROW(D53)-ROW(D$12),0))","v":"M2"},{"$f":"IF($A53<>\"Serviço\",0,ROUND(SUMIF($F$9:$P$9,\"<>\",$F53:$P53),15-13*PO!$X$3))","v":23},null,null,23]
[{"$f":"OFFSET(PO!J$12,ROW(A54)-ROW($A$12),0)","v":"Serviço"},{"$f":"IF($A54=0,\"\",OFFSET(PO!K$12,ROW(B54)-ROW(B$12),0))","v":"1.4.0.0.5."},{"$f":"IF(OFFSET(PO!N$12,ROW(C54)-ROW(C$12),0)=0,\"\",OFFSET(PO!N$12,ROW(C54)-ROW(C$12),0))","v":"TRANSPORTE MANUAL DE REVESTIMENTOS ARGAMASSADOS REMOVIDOS COM CARRINHO DE MÃO 45L - INCLUSO CARGA E DESCARGA"},{"$f":"IF(OFFSET(PO!O$12,ROW(D54)-ROW(D$12),0)=0,\"\",OFFSET(PO!O$12,ROW(D54)-ROW(D$12),0))","v":"M3XKM"},{"$f":"IF($A54<>\"Serviço\",0,ROUND(SUMIF($F$9:$P$9,\"<>\",$F54:$P54),15-13*PO!$X$3))","v":0.02},{"$f":"(25/1000)*((H53)*0.03)","v":1.7249999999999998E-2}]
[{"$f":"OFFSET(PO!J$12,ROW(A55)-ROW($A$12),0)","v":"Serviço"},{"$f":"IF($A55=0,\"\",OFFSET(PO!K$12,ROW(B55)-ROW(B$12),0))","v":"1.4.0.0.6."},{"$f":"IF(OFFSET(PO!N$12,ROW(C55)-ROW(C$12),0)=0,\"\",OFFSET(PO!N$12,ROW(C55)-ROW(C$12),0))","v":"RALO SECO, PVC, DN 100 X 40 MM, JUNTA SOLDÁVEL, FORNECIDO E INSTALADO EM RAMAL DE DESCARGA OU EM RAMAL DE ESGOTO SANITÁRIO. AF_08/2022"},{"$f":"IF(OFFSET(PO!O$12,ROW(D55)-ROW(D$12),0)=0,\"\",OFFSET(PO!O$12,ROW(D55)-ROW(D$12),0))","v":"UN"},{"$f":"IF($A55<>\"Serviço\",0,ROUND(SUMIF($F$9:$P$9,\"<>\",$F55:$P55),15-13*PO!$X$3))","v":2},null,null,2]
[{"$f":"OFFSET(PO!J$12,ROW(A56)-ROW($A$12),0)","v":"Serviço"},{"$f":"IF($A56=0,\"\",OFFSET(PO!K$12,ROW(B56)-ROW(B$12),0))","v":"1.4.0.0.7."},{"$f":"IF(OFFSET(PO!N$12,ROW(C56)-ROW(C$12),0)=0,\"\",OFFSET(PO!N$12,ROW(C56)-ROW(C$12),0))","v":"TUBO PVC, SÉRIE R, ÁGUA PLUVIAL, DN 100 MM, FORNECIDO E INSTALADO EM CONDUTORES VERTICAIS DE ÁGUAS PLUVIAIS. AF_06/2022"},{"$f":"IF(OFFSET(PO!O$12,ROW(D56)-ROW(D$12),0)=0,\"\",OFFSET(PO!O$12,ROW(D56)-ROW(D$12),0))","v":"M"},{"$f":"IF($A56<>\"Serviço\",0,ROUND(SUMIF($F$9:$P$9,\"<>\",$F56:$P56),15-13*PO!$X$3))","v":7.2},{"$f":"3.6*H55","v":7.2}]
[{"$f":"OFFSET(PO!J$12,ROW(A57)-ROW($A$12),0)","v":"Serviço"},{"$f":"IF($A57=0,\"\",OFFSET(PO!K$12,ROW(B57)-ROW(B$12),0))","v":"1.4.0.0.8."},{"$f":"IF(OFFSET(PO!N$12,ROW(C57)-ROW(C$12),0)=0,\"\",OFFSET(PO!N$12,ROW(C57)-ROW(C$12),0))","v":"JOELHO 90 GRAUS, PVC, SERIE R, ÁGUA PLUVIAL, DN 100 MM, JUNTA ELÁSTICA, FORNECIDO E INSTALADO EM RAMAL DE ENCAMINHAMENTO. AF_06/2022"},{"$f":"IF(OFFSET(PO!O$12,ROW(D57)-ROW(D$12),0)=0,\"\",OFFSET(PO!O$12,ROW(D57)-ROW(D$12),0))","v":"UN"},{"$f":"IF($A57<>\"Serviço\",0,ROUND(SUMIF($F$9:$P$9,\"<>\",$F57:$P57),15-13*PO!$X$3))","v":2},{"$f":"H55","v":2}]
[{"$f":"OFFSET(PO!J$12,ROW(A58)-ROW($A$12),0)","v":"Serviço"},{"$f":"IF($A58=0,\"\",OFFSET(PO!K$12,ROW(B58)-ROW(B$12),0))","v":"1.4.0.0.9."},{"$f":"IF(OFFSET(PO!N$12,ROW(C58)-ROW(C$12),0)=0,\"\",OFFSET(PO!N$12,ROW(C58)-ROW(C$12),0))","v":"CONTRAPISO EM ARGAMASSA TRAÇO 1:4 (CIMENTO E AREIA), PREPARO MECÂNICO COM BETONEIRA 400 L, APLICADO EM ÁREAS MOLHADAS SOBRE LAJE, ADERIDO, ACABAMENTO NÃO REFORÇADO, ESPESSURA 3CM. AF_07/2021"},{"$f":"IF(OFFSET(PO!O$12,ROW(D58)-ROW(D$12),0)=0,\"\",OFFSET(PO!O$12,ROW(D58)-ROW(D$12),0))","v":"M2"},{"$f":"IF($A58<>\"Serviço\",0,ROUND(SUMIF($F$9:$P$9,\"<>\",$F58:$P58),15-13*PO!$X$3))","v":23},null,null,23]
[{"$f":"OFFSET(PO!J$12,ROW(A59)-ROW($A$12),0)","v":"Serviço"},{"$f":"IF($A59=0,\"\",OFFSET(PO!K$12,ROW(B59)-ROW(B$12),0))","v":"1.4.0.0.10."},{"$f":"IF(OFFSET(PO!N$12,ROW(C59)-ROW(C$12),0)=0,\"\",OFFSET(PO!N$12,ROW(C59)-ROW(C$12),0))","v":"IMPERMEABILIZAÇÃO DE SUPERFÍCIE COM MEMBRANA À BASE DE POLIURETANO, 2 DEMÃOS. AF_09/2023"},{"$f":"IF(OFFSET(PO!O$12,ROW(D59)-ROW(D$12),0)=0,\"\",OFFSET(PO!O$12,ROW(D59)-ROW(D$12),0))","v":"M2"},{"$f":"IF($A59<>\"Serviço\",0,ROUND(SUMIF($F$9:$P$9,\"<>\",$F59:$P59),15-13*PO!$X$3))","v":28.97},null,null,{"$f":"23+((27.28-3.4)*0.25)","v":28.97}]
[{"$f":"OFFSET(PO!J$12,ROW(A60)-ROW($A$12),0)","v":"Serviço"},{"$f":"IF($A60=0,\"\",OFFSET(PO!K$12,ROW(B60)-ROW(B$12),0))","v":"1.4.0.0.11."},{"$f":"IF(OFFSET(PO!N$12,ROW(C60)-ROW(C$12),0)=0,\"\",OFFSET(PO!N$12,ROW(C60)-ROW(C$12),0))","v":"VEU DE POLIESTER PARA IMPERMEABILIZACAO"},{"$f":"IF(OFFSET(PO!O$12,ROW(D60)-ROW(D$12),0)=0,\"\",OFFSET(PO!O$12,ROW(D60)-ROW(D$12),0))","v":"M2"},{"$f":"IF($A60<>\"Serviço\",0,ROUND(SUMIF($F$9:$P$9,\"<>\",$F60:$P60),15-13*PO!$X$3))","v":28.97},null,null,{"$f":"H59","v":28.97}]
[{"$f":"OFFSET(PO!J$12,ROW(A61)-ROW($A$12),0)","v":"Serviço"},{"$f":"IF($A61=0,\"\",OFFSET(PO!K$12,ROW(B61)-ROW(B$12),0))","v":"1.4.0.0.12."},{"$f":"IF(OFFSET(PO!N$12,ROW(C61)-ROW(C$12),0)=0,\"\",OFFSET(PO!N$12,ROW(C61)-ROW(C$12),0))","v":"REVESTIMENTO CERÂMICO PARA PISO COM PLACAS TIPO PORCELANATO DE DIMENSÕES 80X80 CM APLICADA EM AMBIENTES DE ÁREA MENOR QUE 5 M². AF_02/2023_PE"},{"$f":"IF(OFFSET(PO!O$12,ROW(D61)-ROW(D$12),0)=0,\"\",OFFSET(PO!O$12,ROW(D61)-ROW(D$12),0))","v":"M2"},{"$f":"IF($A61<>\"Serviço\",0,ROUND(SUMIF($F$9:$P$9,\"<>\",$F61:$P61),15-13*PO!$X$3))","v":23},null,null,23]
[{"$f":"OFFSET(PO!J$12,ROW(A62)-ROW($A$12),0)","v":"Serviço"},{"$f":"IF($A62=0,\"\",OFFSET(PO!K$12,ROW(B62)-ROW(B$12),0))","v":"1.4.0.0.13."},{"$f":"IF(OFFSET(PO!N$12,ROW(C62)-ROW(C$12),0)=0,\"\",OFFSET(PO!N$12,ROW(C62)-ROW(C$12),0))","v":"RODAPÉ CERÂMICO DE 7CM DE ALTURA COM PLACAS TIPO ESMALTADA DE DIMENSÕES 80X80CM. AF_02/2023"},{"$f":"IF(OFFSET(PO!O$12,ROW(D62)-ROW(D$12),0)=0,\"\",OFFSET(PO!O$12,ROW(D62)-ROW(D$12),0))","v":"M"},{"$f":"IF($A62<>\"Serviço\",0,ROUND(SUMIF($F$9:$P$9,\"<>\",$F62:$P62),15-13*PO!$X$3))","v":24.74},null,null,24.74]
[{"$f":"OFFSET(PO!J$12,ROW(A63)-ROW($A$12),0)","v":"Serviço"},{"$f":"IF($A63=0,\"\",OFFSET(PO!K$12,ROW(B63)-ROW(B$12),0))","v":"1.4.0.0.14."},{"$f":"IF(OFFSET(PO!N$12,ROW(C63)-ROW(C$12),0)=0,\"\",OFFSET(PO!N$12,ROW(C63)-ROW(C$12),0))","v":"FORRO EM RÉGUAS DE PVC, LISO, PARA AMBIENTES RESIDENCIAIS, INCLUSIVE ESTRUTURA UNIDIRECIONAL DE FIXAÇÃO. AF_08/2023_PS"},{"$f":"IF(OFFSET(PO!O$12,ROW(D63)-ROW(D$12),0)=0,\"\",OFFSET(PO!O$12,ROW(D63)-ROW(D$12),0))","v":"M2"},{"$f":"IF($A63<>\"Serviço\",0,ROUND(SUMIF($F$9:$P$9,\"<>\",$F63:$P63),15-13*PO!$X$3))","v":23},null,null,{"$f":"H61","v":23}]
[{"$f":"OFFSET(PO!J$12,ROW(A64)-ROW($A$12),0)","v":"Serviço"},{"$f":"IF($A64=0,\"\",OFFSET(PO!K$12,ROW(B64)-ROW(B$12),0))","v":"1.4.0.0.15."},{"$f":"IF(OFFSET(PO!N$12,ROW(C64)-ROW(C$12),0)=0,\"\",OFFSET(PO!N$12,ROW(C64)-ROW(C$12),0))","v":"ACABAMENTO SIMPLES/CONVENCIONAL PARA FORRO PVC, TIPO \"U\" OU \"C\", COR BRANCA, COMPRIMENTO 6 M"},{"$f":"IF(OFFSET(PO!O$12,ROW(D64)-ROW(D$12),0)=0,\"\",OFFSET(PO!O$12,ROW(D64)-ROW(D$12),0))","v":"M"},{"$f":"IF($A64<>\"Serviço\",0,ROUND(SUMIF($F$9:$P$9,\"<>\",$F64:$P64),15-13*PO!$X$3))","v":28.14},null,null,28.14]
[{"$f":"OFFSET(PO!J$12,ROW(A65)-ROW($A$12),0)","v":"Nível 2"},{"$f":"IF($A65=0,\"\",OFFSET(PO!K$12,ROW(B65)-ROW(B$12),0))","v":"1.5."},{"$f":"IF(OFFSET(PO!N$12,ROW(C65)-ROW(C$12),0)=0,\"\",OFFSET(PO!N$12,ROW(C65)-ROW(C$12),0))","v":"TRATAMENTO DE TRINCAS E FISSURAS"},{"$f":"IF(OFFSET(PO!O$12,ROW(D65)-ROW(D$12),0)=0,\"\",OFFSET(PO!O$12,ROW(D65)-ROW(D$12),0))","v":""},{"$f":"IF($A65<>\"Serviço\",0,ROUND(SUMIF($F$9:$P$9,\"<>\",$F65:$P65),15-13*PO!$X$3))","v":0}]
[{"$f":"OFFSET(PO!J$12,ROW(A66)-ROW($A$12),0)","v":"Serviço"},{"$f":"IF($A66=0,\"\",OFFSET(PO!K$12,ROW(B66)-ROW(B$12),0))","v":"1.5.0.0.1."},{"$f":"IF(OFFSET(PO!N$12,ROW(C66)-ROW(C$12),0)=0,\"\",OFFSET(PO!N$12,ROW(C66)-ROW(C$12),0))","v":"IMPERMEABILIZAÇÃO DE SUPERFÍCIE COM ARGAMASSA POLIMÉRICA / MEMBRANA ACRÍLICA, 4 DEMÃOS, REFORÇADA COM VÉU DE POLIÉSTER (MAV). AF_09/2023"},{"$f":"IF(OFFSET(PO!O$12,ROW(D66)-ROW(D$12),0)=0,\"\",OFFSET(PO!O$12,ROW(D66)-ROW(D$12),0))","v":"M2"},{"$f":"IF($A66<>\"Serviço\",0,ROUND(SUMIF($F$9:$P$9,\"<>\",$F66:$P66),15-13*PO!$X$3))","v":15},15]
[{"$f":"OFFSET(PO!J$12,ROW(A67)-ROW($A$12),0)","v":"Nível 2"},{"$f":"IF($A67=0,\"\",OFFSET(PO!K$12,ROW(B67)-ROW(B$12),0))","v":"1.6."},{"$f":"IF(OFFSET(PO!N$12,ROW(C67)-ROW(C$12),0)=0,\"\",OFFSET(PO!N$12,ROW(C67)-ROW(C$12),0))","v":"ESQUADRIAS"},{"$f":"IF(OFFSET(PO!O$12,ROW(D67)-ROW(D$12),0)=0,\"\",OFFSET(PO!O$12,ROW(D67)-ROW(D$12),0))","v":"es"},{"$f":"IF($A67<>\"Serviço\",0,ROUND(SUMIF($F$9:$P$9,\"<>\",$F67:$P67),15-13*PO!$X$3))","v":0}]
[{"$f":"OFFSET(PO!J$12,ROW(A68)-ROW($A$12),0)","v":"Serviço"},{"$f":"IF($A68=0,\"\",OFFSET(PO!K$12,ROW(B68)-ROW(B$12),0))","v":"1.6.0.0.1."},{"$f":"IF(OFFSET(PO!N$12,ROW(C68)-ROW(C$12),0)=0,\"\",OFFSET(PO!N$12,ROW(C68)-ROW(C$12),0))","v":"REMOÇÃO DE PORTAS, DE FORMA MANUAL, SEM REAPROVEITAMENTO. AF_09/2023"},{"$f":"IF(OFFSET(PO!O$12,ROW(D68)-ROW(D$12),0)=0,\"\",OFFSET(PO!O$12,ROW(D68)-ROW(D$12),0))","v":"M2"},{"$f":"IF($A68<>\"Serviço\",0,ROUND(SUMIF($F$9:$P$9,\"<>\",$F68:$P68),15-13*PO!$X$3))","v":10},null,5,5]
[{"$f":"OFFSET(PO!J$12,ROW(A69)-ROW($A$12),0)","v":"Serviço"},{"$f":"IF($A69=0,\"\",OFFSET(PO!K$12,ROW(B69)-ROW(B$12),0))","v":"1.6.0.0.2."},{"$f":"IF(OFFSET(PO!N$12,ROW(C69)-ROW(C$12),0)=0,\"\",OFFSET(PO!N$12,ROW(C69)-ROW(C$12),0))","v":"REMOÇÃO DE VIDRO LISO COMUM DE ESQUADRIA COM BAGUETE DE ALUMÍNIO OU PVC. AF_01/2021"},{"$f":"IF(OFFSET(PO!O$12,ROW(D69)-ROW(D$12),0)=0,\"\",OFFSET(PO!O$12,ROW(D69)-ROW(D$12),0))","v":"M2"},{"$f":"IF($A69<>\"Serviço\",0,ROUND(SUMIF($F$9:$P$9,\"<>\",$F69:$P69),15-13*PO!$X$3))","v":29.4},null,{"$f":"4.9*6","v":29.400000000000002}]
[{"$f":"OFFSET(PO!J$12,ROW(A70)-ROW($A$12),0)","v":"Serviço"},{"$f":"IF($A70=0,\"\",OFFSET(PO!K$12,ROW(B70)-ROW(B$12),0))","v":"1.6.0.0.3."},{"$f":"IF(OFFSET(PO!N$12,ROW(C70)-ROW(C$12),0)=0,\"\",OFFSET(PO!N$12,ROW(C70)-ROW(C$12),0))","v":"REMOÇÃO DE JANELAS DE ALUMÍNIO E VIDRO, COM REAPROVEITAMENTO, E REINSTALAÇÃO - INCLUSO MATERIAL PARA TODAS AS VEDAÇÕES NECESSÁRIAS"},{"$f":"IF(OFFSET(PO!O$12,ROW(D70)-ROW(D$12),0)=0,\"\",OFFSET(PO!O$12,ROW(D70)-ROW(D$12),0))","v":"M2"},{"$f":"IF($A70<>\"Serviço\",0,ROUND(SUMIF($F$9:$P$9,\"<>\",$F70:$P70),15-13*PO!$X$3))","v":19.45},null,{"$f":"(1.5*0.6*7)+(1.5*0.5*2)+(1.2*0.6)+(0.5*0.5*4)+(0.7*2.9)","v":11.549999999999999},{"$f":"(1.55*1)+(1.5*0.6*4)+(0.7*2.9)+(0.6*0.6*2)","v":7.8999999999999995}]
[{"$f":"OFFSET(PO!J$12,ROW(A71)-ROW($A$12),0)","v":"Serviço"},{"$f":"IF($A71=0,\"\",OFFSET(PO!K$12,ROW(B71)-ROW(B$12),0))","v":"1.6.0.0.4."},{"$f":"IF(OFFSET(PO!N$12,ROW(C71)-ROW(C$12),0)=0,\"\",OFFSET(PO!N$12,ROW(C71)-ROW(C$12),0))","v":"REMOÇÃO (COM REAPROVEITAMENTO) E REINSTALAÇÃO DE PORTA DE MADEIRA 3,40X210M - INCLUSO MATERIAIS NECESSÁRIOS PARA VEDAÇÃO"},{"$f":"IF(OFFSET(PO!O$12,ROW(D71)-ROW(D$12),0)=0,\"\",OFFSET(PO!O$12,ROW(D71)-ROW(D$12),0))","v":"M2"},{"$f":"IF($A71<>\"Serviço\",0,ROUND(SUMIF($F$9:$P$9,\"<>\",$F71:$P71),15-13*PO!$X$3))","v":7.14},null,null,{"$f":"3.4*2.1","v":7.14}]
[{"$f":"OFFSET(PO!J$12,ROW(A72)-ROW($A$12),0)","v":"Serviço"},{"$f":"IF($A72=0,\"\",OFFSET(PO!K$12,ROW(B72)-ROW(B$12),0))","v":"1.6.0.0.5."},{"$f":"IF(OFFSET(PO!N$12,ROW(C72)-ROW(C$12),0)=0,\"\",OFFSET(PO!N$12,ROW(C72)-ROW(C$12),0))","v":"IMPERMEABILIZAÇÃO DE SUPERFÍCIE COM ARGAMASSA POLIMÉRICA / MEMBRANA ACRÍLICA, 4 DEMÃOS, REFORÇADA COM VÉU DE POLIÉSTER (MAV). AF_09/2023"},{"$f":"IF(OFFSET(PO!O$12,ROW(D72)-ROW(D$12),0)=0,\"\",OFFSET(PO!O$12,ROW(D72)-ROW(D$12),0))","v":"M2"},{"$f":"IF($A72<>\"Serviço\",0,ROUND(SUMIF($F$9:$P$9,\"<>\",$F72:$P72),15-13*PO!$X$3))","v":1.5},null,{"$f":"5*(0.15+0.15)","v":1.5}]
[{"$f":"OFFSET(PO!J$12,ROW(A73)-ROW($A$12),0)","v":"Serviço"},{"$f":"IF($A73=0,\"\",OFFSET(PO!K$12,ROW(B73)-ROW(B$12),0))","v":"1.6.0.0.6."},{"$f":"IF(OFFSET(PO!N$12,ROW(C73)-ROW(C$12),0)=0,\"\",OFFSET(PO!N$12,ROW(C73)-ROW(C$12),0))","v":"PELE DE VIDRO LAMINADO REFLETIVO PRATA, ESPESSURA 4 MM + 4 MM - FORNECIMENTO E INSTALAÇÃO"},{"$f":"IF(OFFSET(PO!O$12,ROW(D73)-ROW(D$12),0)=0,\"\",OFFSET(PO!O$12,ROW(D73)-ROW(D$12),0))","v":"M2"},{"$f":"IF($A73<>\"Serviço\",0,ROUND(SUMIF($F$9:$P$9,\"<>\",$F73:$P73),15-13*PO!$X$3))","v":28.67},null,{"$f":"4.9*5.85","v":28.664999999999999}]
[{"$f":"OFFSET(PO!J$12,ROW(A74)-ROW($A$12),0)","v":"Serviço"},{"$f":"IF($A74=0,\"\",OFFSET(PO!K$12,ROW(B74)-ROW(B$12),0))","v":"1.6.0.0.7."},{"$f":"IF(OFFSET(PO!N$12,ROW(C74)-ROW(C$12),0)=0,\"\",OFFSET(PO!N$12,ROW(C74)-ROW(C$12),0))","v":"PORTA DE ALUMÍNIO DE ABRIR COM LAMBRI, COM GUARNIÇÃO, FIXAÇÃO COM PARAFUSOS - FORNECIMENTO E INSTALAÇÃO. AF_12/2019"},{"$f":"IF(OFFSET(PO!O$12,ROW(D74)-ROW(D$12),0)=0,\"\",OFFSET(PO!O$12,ROW(D74)-ROW(D$12),0))","v":"M2"},{"$f":"IF($A74<>\"Serviço\",0,ROUND(SUMIF($F$9:$P$9,\"<>\",$F74:$P74),15-13*PO!$X$3))","v":17.22},null,{"$f":"(1*2.1)+(0.9*2.1*2)+(0.8*2.1*2)","v":9.240000000000002},{"$f":"(0.8*2.1*3)+(0.7*2.1*2)","v":7.98}]
[{"$f":"OFFSET(PO!J$12,ROW(A75)-ROW($A$12),0)","v":"Serviço"},{"$f":"IF($A75=0,\"\",OFFSET(PO!K$12,ROW(B75)-ROW(B$12),0))","v":"1.6.0.0.8."},{"$f":"IF(OFFSET(PO!N$12,ROW(C75)-ROW(C$12),0)=0,\"\",OFFSET(PO!N$12,ROW(C75)-ROW(C$12),0))","v":"PEITORIL/SOLEIRA EM MÁRMORE, COM FRISO PINGADEIRA, LARGURA 20CM, ESPESSURA 2,0CM, COM SELAMENTO EM PU - FORNECIMENTO E INSTALAÇÃO"},{"$f":"IF(OFFSET(PO!O$12,ROW(D75)-ROW(D$12),0)=0,\"\",OFFSET(PO!O$12,ROW(D75)-ROW(D$12),0))","v":"M"},{"$f":"IF($A75<>\"Serviço\",0,ROUND(SUMIF($F$9:$P$9,\"<>\",$F75:$P75),15-13*PO!$X$3))","v":45.85},null,{"$f":"(1.5*9)+1.2+(0.6*4)+0.7+(15*0.04*2)","v":18.999999999999996},{"$f":"(0.6*2)+(1.5*5)+0.7+(18.41-0.8-0.8)+(8*2*0.04)","v":26.849999999999998}]
[{"$f":"OFFSET(PO!J$12,ROW(A76)-ROW($A$12),0)","v":"Serviço"},{"$f":"IF($A76=0,\"\",OFFSET(PO!K$12,ROW(B76)-ROW(B$12),0))","v":"1.6.0.0.9."},{"$f":"IF(OFFSET(PO!N$12,ROW(C76)-ROW(C$12),0)=0,\"\",OFFSET(PO!N$12,ROW(C76)-ROW(C$12),0))","v":"CONTRAVERGA MOLDADA IN LOCO EM CONCRETO, ESPESSURA DE *10* CM. AF_03/2024"},{"$f":"IF(OFFSET(PO!O$12,ROW(D76)-ROW(D$12),0)=0,\"\",OFFSET(PO!O$12,ROW(D76)-ROW(D$12),0))","v":"M"},{"$f":"IF($A76<>\"Serviço\",0,ROUND(SUMIF($F$9:$P$9,\"<>\",$F76:$P76),15-13*PO!$X$3))","v":19.45},null,{"$f":"((1.5+0.5)*2)+5.4","v":9.4},{"$f":"((1.5+0.5)*4)+(1.55+0.5)","v":10.050000000000001}]
[{"$f":"OFFSET(PO!J$12,ROW(A77)-ROW($A$12),0)","v":"Serviço"},{"$f":"IF($A77=0,\"\",OFFSET(PO!K$12,ROW(B77)-ROW(B$12),0))","v":"1.6.0.0.10."},{"$f":"IF(OFFSET(PO!N$12,ROW(C77)-ROW(C$12),0)=0,\"\",OFFSET(PO!N$12,ROW(C77)-ROW(C$12),0))","v":"REQUADRO DE ESQUADRIA COM DEMOLIÇÃO E RECOMPOSIÇÃO DO REVESTIMENTO (BORDAS 30CM)"},{"$f":"IF(OFFSET(PO!O$12,ROW(D77)-ROW(D$12),0)=0,\"\",OFFSET(PO!O$12,ROW(D77)-ROW(D$12),0))","v":"M"},{"$f":"IF($A77<>\"Serviço\",0,ROUND(SUMIF($F$9:$P$9,\"<>\",$F77:$P77),15-13*PO!$X$3))","v":90.1},null,{"$f":"((1.5+0.6+1.5+0.6)*7)+((1.5+0.5+0.5+1.5)*2)+(1.2+0.6+1.2+0.6)+((0.5+0.5+0.5+0.5)*4)+(0.7+0.7+2.9+2.9)","v":56.2},{"$f":"(1.55+1+1.55+1)+((1.5+0.6+1.5+0.6)*4)+(0.7+0.7+2.9+2.9)+((0.6+0.6+0.6+0.6)*2)","v":33.9}]
[{"$f":"OFFSET(PO!J$12,ROW(A78)-ROW($A$12),0)","v":"Serviço"},{"$f":"IF($A78=0,\"\",OFFSET(PO!K$12,ROW(B78)-ROW(B$12),0))","v":"1.6.0.0.11."},{"$f":"IF(OFFSET(PO!N$12,ROW(C78)-ROW(C$12),0)=0,\"\",OFFSET(PO!N$12,ROW(C78)-ROW(C$12),0))","v":"REQUADRO DE ABERTURA PARA PELE DE VIDRO"},{"$f":"IF(OFFSET(PO!O$12,ROW(D78)-ROW(D$12),0)=0,\"\",OFFSET(PO!O$12,ROW(D78)-ROW(D$12),0))","v":"M"},{"$f":"IF($A78<>\"Serviço\",0,ROUND(SUMIF($F$9:$P$9,\"<>\",$F78:$P78),15-13*PO!$X$3))","v":21.5},{"$f":"4.9+4.9+5.85+5.85","v":21.5}]
[{"$f":"OFFSET(PO!J$12,ROW(A79)-ROW($A$12),0)","v":"Nível 2"},{"$f":"IF($A79=0,\"\",OFFSET(PO!K$12,ROW(B79)-ROW(B$12),0))","v":"1.7."},{"$f":"IF(OFFSET(PO!N$12,ROW(C79)-ROW(C$12),0)=0,\"\",OFFSET(PO!N$12,ROW(C79)-ROW(C$12),0))","v":"CALÇADA EXTERNA DA FACHADA LESTE"},{"$f":"IF(OFFSET(PO!O$12,ROW(D79)-ROW(D$12),0)=0,\"\",OFFSET(PO!O$12,ROW(D79)-ROW(D$12),0))","v":""},{"$f":"IF($A79<>\"Serviço\",0,ROUND(SUMIF($F$9:$P$9,\"<>\",$F79:$P79),15-13*PO!$X$3))","v":0}]
[{"$f":"OFFSET(PO!J$12,ROW(A80)-ROW($A$12),0)","v":"Serviço"},{"$f":"IF($A80=0,\"\",OFFSET(PO!K$12,ROW(B80)-ROW(B$12),0))","v":"1.7.0.0.1."},{"$f":"IF(OFFSET(PO!N$12,ROW(C80)-ROW(C$12),0)=0,\"\",OFFSET(PO!N$12,ROW(C80)-ROW(C$12),0))","v":"LIMPEZA DE SUPERFÍCIE COM JATO DE ALTA PRESSÃO. AF_04/2019"},{"$f":"IF(OFFSET(PO!O$12,ROW(D80)-ROW(D$12),0)=0,\"\",OFFSET(PO!O$12,ROW(D80)-ROW(D$12),0))","v":"M2"},{"$f":"IF($A80<>\"Serviço\",0,ROUND(SUMIF($F$9:$P$9,\"<>\",$F80:$P80),15-13*PO!$X$3))","v":15.53},null,{"$f":"G81","v":15.524999999999999}]
[{"$f":"OFFSET(PO!J$12,ROW(A81)-ROW($A$12),0)","v":"Serviço"},{"$f":"IF($A81=0,\"\",OFFSET(PO!K$12,ROW(B81)-ROW(B$12),0))","v":"1.7.0.0.2."},{"$f":"IF(OFFSET(PO!N$12,ROW(C81)-ROW(C$12),0)=0,\"\",OFFSET(PO!N$12,ROW(C81)-ROW(C$12),0))","v":"IMPERMEABILIZAÇÃO DE SUPERFÍCIE COM ARGAMASSA DE CIMENTO E AREIA, COM ADITIVO IMPERMEABILIZANTE, E = 1,5CM. AF_09/2023"},{"$f":"IF(OFFSET(PO!O$12,ROW(D81)-ROW(D$12),0)=0,\"\",OFFSET(PO!O$12,ROW(D81)-ROW(D$12),0))","v":"M2"},{"$f":"IF($A81<>\"Serviço\",0,ROUND(SUMIF($F$9:$P$9,\"<>\",$F81:$P81),15-13*PO!$X$3))","v":15.53},null,{"$f":"10.35*1.5","v":15.524999999999999}]
[{"$f":"OFFSET(PO!J$12,ROW(A82)-ROW($A$12),0)","v":"Serviço"},{"$f":"IF($A82=0,\"\",OFFSET(PO!K$12,ROW(B82)-ROW(B$12),0))","v":"1.7.0.0.3."},{"$f":"IF(OFFSET(PO!N$12,ROW(C82)-ROW(C$12),0)=0,\"\",OFFSET(PO!N$12,ROW(C82)-ROW(C$12),0))","v":"IMPERMEABILIZAÇÃO DE SUPERFÍCIE COM ARGAMASSA POLIMÉRICA / MEMBRANA ACRÍLICA, 4 DEMÃOS, REFORÇADA COM VÉU DE POLIÉSTER (MAV). AF_09/2023"},{"$f":"IF(OFFSET(PO!O$12,ROW(D82)-ROW(D$12),0)=0,\"\",OFFSET(PO!O$12,ROW(D82)-ROW(D$12),0))","v":"M2"},{"$f":"IF($A82<>\"Serviço\",0,ROUND(SUMIF($F$9:$P$9,\"<>\",$F82:$P82),15-13*PO!$X$3))","v":15.53},null,{"$f":"G81","v":15.524999999999999}]
[{"$f":"OFFSET(PO!J$12,ROW(A83)-ROW($A$12),0)","v":"Nível 2"},{"$f":"IF($A83=0,\"\",OFFSET(PO!K$12,ROW(B83)-ROW(B$12),0))","v":"1.8."},{"$f":"IF(OFFSET(PO!N$12,ROW(C83)-ROW(C$12),0)=0,\"\",OFFSET(PO!N$12,ROW(C83)-ROW(C$12),0))","v":"SERVIÇOS FINAIS"},{"$f":"IF(OFFSET(PO!O$12,ROW(D83)-ROW(D$12),0)=0,\"\",OFFSET(PO!O$12,ROW(D83)-ROW(D$12),0))","v":""},{"$f":"IF($A83<>\"Serviço\",0,ROUND(SUMIF($F$9:$P$9,\"<>\",$F83:$P83),15-13*PO!$X$3))","v":0}]
[{"$f":"OFFSET(PO!J$12,ROW(A84)-ROW($A$12),0)","v":"Serviço"},{"$f":"IF($A84=0,\"\",OFFSET(PO!K$12,ROW(B84)-ROW(B$12),0))","v":"1.8.0.0.1."},{"$f":"IF(OFFSET(PO!N$12,ROW(C84)-ROW(C$12),0)=0,\"\",OFFSET(PO!N$12,ROW(C84)-ROW(C$12),0))","v":"LIMPEZA DE JANELA INTEIRAMENTE DE VIDRO. AF_04/2019"},{"$f":"IF(OFFSET(PO!O$12,ROW(D84)-ROW(D$12),0)=0,\"\",OFFSET(PO!O$12,ROW(D84)-ROW(D$12),0))","v":"M2"},{"$f":"IF($A84<>\"Serviço\",0,ROUND(SUMIF($F$9:$P$9,\"<>\",$F84:$P84),15-13*PO!$X$3))","v":48.12},null,{"$f":"G70+G73","v":40.214999999999996},{"$f":"H70","v":7.8999999999999995}]
[{"$f":"OFFSET(PO!J$12,ROW(A85)-ROW($A$12),0)","v":"Serviço"},{"$f":"IF($A85=0,\"\",OFFSET(PO!K$12,ROW(B85)-ROW(B$12),0))","v":"1.8.0.0.2."},{"$f":"IF(OFFSET(PO!N$12,ROW(C85)-ROW(C$12),0)=0,\"\",OFFSET(PO!N$12,ROW(C85)-ROW(C$12),0))","v":"LIMPEZA DE PISO CERÂMICO OU PORCELANATO COM PANO ÚMIDO. AF_04/2019"},{"$f":"IF(OFFSET(PO!O$12,ROW(D85)-ROW(D$12),0)=0,\"\",OFFSET(PO!O$12,ROW(D85)-ROW(D$12),0))","v":"M2"},{"$f":"IF($A85<>\"Serviço\",0,ROUND(SUMIF($F$9:$P$9,\"<>\",$F85:$P85),15-13*PO!$X$3))","v":23},null,{"$f":"H61","v":23}]
[{"$f":"OFFSET(PO!J$12,ROW(A86)-ROW($A$12),0)","v":"Meta"},{"$f":"IF($A86=0,\"\",OFFSET(PO!K$12,ROW(B86)-ROW(B$12),0))","v":"2."},{"$f":"IF(OFFSET(PO!N$12,ROW(C86)-ROW(C$12),0)=0,\"\",OFFSET(PO!N$12,ROW(C86)-ROW(C$12),0))","v":"LOTE 1 - 2ª ETAPA DA REFORMA"},{"$f":"IF(OFFSET(PO!O$12,ROW(D86)-ROW(D$12),0)=0,\"\",OFFSET(PO!O$12,ROW(D86)-ROW(D$12),0))","v":""},{"$f":"IF($A86<>\"Serviço\",0,ROUND(SUMIF($F$9:$P$9,\"<>\",$F86:$P86),15-13*PO!$X$3))","v":0}]
[{"$f":"OFFSET(PO!J$12,ROW(A87)-ROW($A$12),0)","v":"Nível 2"},{"$f":"IF($A87=0,\"\",OFFSET(PO!K$12,ROW(B87)-ROW(B$12),0))","v":"2.1."},{"$f":"IF(OFFSET(PO!N$12,ROW(C87)-ROW(C$12),0)=0,\"\",OFFSET(PO!N$12,ROW(C87)-ROW(C$12),0))","v":"SERVIÇOS INICIAIS"},{"$f":"IF(OFFSET(PO!O$12,ROW(D87)-ROW(D$12),0)=0,\"\",OFFSET(PO!O$12,ROW(D87)-ROW(D$12),0))","v":""},{"$f":"IF($A87<>\"Serviço\",0,ROUND(SUMIF($F$9:$P$9,\"<>\",$F87:$P87),15-13*PO!$X$3))","v":0}]
[{"$f":"OFFSET(PO!J$12,ROW(A88)-ROW($A$12),0)","v":"Serviço"},{"$f":"IF($A88=0,\"\",OFFSET(PO!K$12,ROW(B88)-ROW(B$12),0))","v":"2.1.0.0.1."},{"$f":"IF(OFFSET(PO!N$12,ROW(C88)-ROW(C$12),0)=0,\"\",OFFSET(PO!N$12,ROW(C88)-ROW(C$12),0))","v":"ADMINSTRAÇÃO LOCAL "},{"$f":"IF(OFFSET(PO!O$12,ROW(D88)-ROW(D$12),0)=0,\"\",OFFSET(PO!O$12,ROW(D88)-ROW(D$12),0))","v":"MÊS"},{"$f":"IF($A88<>\"Serviço\",0,ROUND(SUMIF($F$9:$P$9,\"<>\",$F88:$P88),15-13*PO!$X$3))","v":2},2]
[{"$f":"OFFSET(PO!J$12,ROW(A89)-ROW($A$12),0)","v":"Nível 2"},{"$f":"IF($A89=0,\"\",OFFSET(PO!K$12,ROW(B89)-ROW(B$12),0))","v":"2.2."},{"$f":"IF(OFFSET(PO!N$12,ROW(C89)-ROW(C$12),0)=0,\"\",OFFSET(PO!N$12,ROW(C89)-ROW(C$12),0))","v":"ESCADA"},{"$f":"IF(OFFSET(PO!O$12,ROW(D89)-ROW(D$12),0)=0,\"\",OFFSET(PO!O$12,ROW(D89)-ROW(D$12),0))","v":""},{"$f":"IF($A89<>\"Serviço\",0,ROUND(SUMIF($F$9:$P$9,\"<>\",$F89:$P89),15-13*PO!$X$3))","v":0}]
[{"$f":"OFFSET(PO!J$12,ROW(A90)-ROW($A$12),0)","v":"Serviço"},{"$f":"IF($A90=0,\"\",OFFSET(PO!K$12,ROW(B90)-ROW(B$12),0))","v":"2.2.0.0.1."},{"$f":"IF(OFFSET(PO!N$12,ROW(C90)-ROW(C$12),0)=0,\"\",OFFSET(PO!N$12,ROW(C90)-ROW(C$12),0))","v":"DEMOLIÇÃO DE LAJES, EM CONCRETO ARMADO, DE FORMA MECANIZADA COM MARTELETE, SEM REAPROVEITAMENTO. AF_09/2023"},{"$f":"IF(OFFSET(PO!O$12,ROW(D90)-ROW(D$12),0)=0,\"\",OFFSET(PO!O$12,ROW(D90)-ROW(D$12),0))","v":"M3"},{"$f":"IF($A90<>\"Serviço\",0,ROUND(SUMIF($F$9:$P$9,\"<>\",$F90:$P90),15-13*PO!$X$3))","v":2.81},{"$f":"13.37*0.21","v":2.8076999999999996}]
[{"$f":"OFFSET(PO!J$12,ROW(A91)-ROW($A$12),0)","v":"Serviço"},{"$f":"IF($A91=0,\"\",OFFSET(PO!K$12,ROW(B91)-ROW(B$12),0))","v":"2.2.0.0.2."},{"$f":"IF(OFFSET(PO!N$12,ROW(C91)-ROW(C$12),0)=0,\"\",OFFSET(PO!N$12,ROW(C91)-ROW(C$12),0))","v":"TRANSPORTE MANUAL DE REVESTIMENTOS ARGAMASSADOS REMOVIDOS COM CARRINHO DE MÃO 45L - INCLUSO CARGA E DESCARGA"},{"$f":"IF(OFFSET(PO!O$12,ROW(D91)-ROW(D$12),0)=0,\"\",OFFSET(PO!O$12,ROW(D91)-ROW(D$12),0))","v":"M3XKM"},{"$f":"IF($A91<>\"Serviço\",0,ROUND(SUMIF($F$9:$P$9,\"<>\",$F91:$P91),15-13*PO!$X$3))","v":2.81},{"$f":"F90","v":2.8076999999999996}]
[{"$f":"OFFSET(PO!J$12,ROW(A92)-ROW($A$12),0)","v":"Serviço"},{"$f":"IF($A92=0,\"\",OFFSET(PO!K$12,ROW(B92)-ROW(B$12),0))","v":"2.2.0.0.3."},{"$f":"IF(OFFSET(PO!N$12,ROW(C92)-ROW(C$12),0)=0,\"\",OFFSET(PO!N$12,ROW(C92)-ROW(C$12),0))","v":"ESCADA EM CONCRETO ARMADO MOLDADO IN LOCO, FCK 25 MPA, APENAS PISANTES, SEM ARMADURA, FÔRMA EM CHAPA DE MADEIRA COMPENSADA RESINADA."},{"$f":"IF(OFFSET(PO!O$12,ROW(D92)-ROW(D$12),0)=0,\"\",OFFSET(PO!O$12,ROW(D92)-ROW(D$12),0))","v":"M³"},{"$f":"IF($A92<>\"Serviço\",0,ROUND(SUMIF($F$9:$P$9,\"<>\",$F92:$P92),15-13*PO!$X$3))","v":1.83},1.83]
[{"$f":"OFFSET(PO!J$12,ROW(A93)-ROW($A$12),0)","v":"Serviço"},{"$f":"IF($A93=0,\"\",OFFSET(PO!K$12,ROW(B93)-ROW(B$12),0))","v":"2.2.0.0.4."},{"$f":"IF(OFFSET(PO!N$12,ROW(C93)-ROW(C$12),0)=0,\"\",OFFSET(PO!N$12,ROW(C93)-ROW(C$12),0))","v":"PISO EM GRANITO APLICADO EM AMBIENTES INTERNOS. AF_09/2020"},{"$f":"IF(OFFSET(PO!O$12,ROW(D93)-ROW(D$12),0)=0,\"\",OFFSET(PO!O$12,ROW(D93)-ROW(D$12),0))","v":"M2"},{"$f":"IF($A93<>\"Serviço\",0,ROUND(SUMIF($F$9:$P$9,\"<>\",$F93:$P93),15-13*PO!$X$3))","v":13.8},13.8]
[{"$f":"OFFSET(PO!J$12,ROW(A94)-ROW($A$12),0)","v":"Nível 2"},{"$f":"IF($A94=0,\"\",OFFSET(PO!K$12,ROW(B94)-ROW(B$12),0))","v":"2.3."},{"$f":"IF(OFFSET(PO!N$12,ROW(C94)-ROW(C$12),0)=0,\"\",OFFSET(PO!N$12,ROW(C94)-ROW(C$12),0))","v":"INSTALAÇÕES ELÉTRICAS"},{"$f":"IF(OFFSET(PO!O$12,ROW(D94)-ROW(D$12),0)=0,\"\",OFFSET(PO!O$12,ROW(D94)-ROW(D$12),0))","v":""},{"$f":"IF($A94<>\"Serviço\",0,ROUND(SUMIF($F$9:$P$9,\"<>\",$F94:$P94),15-13*PO!$X$3))","v":0}]
[{"$f":"OFFSET(PO!J$12,ROW(A95)-ROW($A$12),0)","v":"Serviço"},{"$f":"IF($A95=0,\"\",OFFSET(PO!K$12,ROW(B95)-ROW(B$12),0))","v":"2.3.0.0.1."},{"$f":"IF(OFFSET(PO!N$12,ROW(C95)-ROW(C$12),0)=0,\"\",OFFSET(PO!N$12,ROW(C95)-ROW(C$12),0))","v":"LUMINÁRIA LED PLAFON EMBUTIR 24W - FORNECIMENTO E INSTALAÇÃO"},{"$f":"IF(OFFSET(PO!O$12,ROW(D95)-ROW(D$12),0)=0,\"\",OFFSET(PO!O$12,ROW(D95)-ROW(D$12),0))","v":"UN "},{"$f":"IF($A95<>\"Serviço\",0,ROUND(SUMIF($F$9:$P$9,\"<>\",$F95:$P95),15-13*PO!$X$3))","v":44},null,null,44]
[{"$f":"OFFSET(PO!J$12,ROW(A96)-ROW($A$12),0)","v":"Serviço"},{"$f":"IF($A96=0,\"\",OFFSET(PO!K$12,ROW(B96)-ROW(B$12),0))","v":"2.3.0.0.2."},{"$f":"IF(OFFSET(PO!N$12,ROW(C96)-ROW(C$12),0)=0,\"\",OFFSET(PO!N$12,ROW(C96)-ROW(C$12),0))","v":"ELETRODUTO FLEXÍVEL CORRUGADO REFORÇADO, PVC, DN 25 MM (3/4\"), PARA CIRCUITOS TERMINAIS, INSTALADO EM LAJE - FORNECIMENTO E INSTALAÇÃO. AF_03/2023"},{"$f":"IF(OFFSET(PO!O$12,ROW(D96)-ROW(D$12),0)=0,\"\",OFFSET(PO!O$12,ROW(D96)-ROW(D$12),0))","v":"M"},{"$f":"IF($A96<>\"Serviço\",0,ROUND(SUMIF($F$9:$P$9,\"<>\",$F96:$P96),15-13*PO!$X$3))","v":70},null,null,70]
[{"$f":"OFFSET(PO!J$12,ROW(A97)-ROW($A$12),0)","v":"Serviço"},{"$f":"IF($A97=0,\"\",OFFSET(PO!K$12,ROW(B97)-ROW(B$12),0))","v":"2.3.0.0.3."},{"$f":"IF(OFFSET(PO!N$12,ROW(C97)-ROW(C$12),0)=0,\"\",OFFSET(PO!N$12,ROW(C97)-ROW(C$12),0))","v":"ELETRODUTO RÍGIDO SOLDÁVEL, PVC, DN 32 MM (1\"), APARENTE - FORNECIMENTO E INSTALAÇÃO. AF_10/2022"},{"$f":"IF(OFFSET(PO!O$12,ROW(D97)-ROW(D$12),0)=0,\"\",OFFSET(PO!O$12,ROW(D97)-ROW(D$12),0))","v":"M"},{"$f":"IF($A97<>\"Serviço\",0,ROUND(SUMIF($F$9:$P$9,\"<>\",$F97:$P97),15-13*PO!$X$3))","v":7},7]
[{"$f":"OFFSET(PO!J$12,ROW(A98)-ROW($A$12),0)","v":"Serviço"},{"$f":"IF($A98=0,\"\",OFFSET(PO!K$12,ROW(B98)-ROW(B$12),0))","v":"2.3.0.0.4."},{"$f":"IF(OFFSET(PO!N$12,ROW(C98)-ROW(C$12),0)=0,\"\",OFFSET(PO!N$12,ROW(C98)-ROW(C$12),0))","v":"CABO DE COBRE FLEXÍVEL ISOLADO, 2,5 MM², ANTI-CHAMA 0,6/1,0 KV, PARA CIRCUITOS TERMINAIS - FORNECIMENTO E INSTALAÇÃO. AF_03/2023"},{"$f":"IF(OFFSET(PO!O$12,ROW(D98)-ROW(D$12),0)=0,\"\",OFFSET(PO!O$12,ROW(D98)-ROW(D$12),0))","v":"M"},{"$f":"IF($A98<>\"Serviço\",0,ROUND(SUMIF($F$9:$P$9,\"<>\",$F98:$P98),15-13*PO!$X$3))","v":140},null,null,140]
[{"$f":"OFFSET(PO!J$12,ROW(A99)-ROW($A$12),0)","v":"Serviço"},{"$f":"IF($A99=0,\"\",OFFSET(PO!K$12,ROW(B99)-ROW(B$12),0))","v":"2.3.0.0.5."},{"$f":"IF(OFFSET(PO!N$12,ROW(C99)-ROW(C$12),0)=0,\"\",OFFSET(PO!N$12,ROW(C99)-ROW(C$12),0))","v":"TOMADA BAIXA DE EMBUTIR (1 MÓDULO), 2P+T 10 A, INCLUINDO SUPORTE E PLACA - FORNECIMENTO E INSTALAÇÃO. AF_03/2023"},{"$f":"IF(OFFSET(PO!O$12,ROW(D99)-ROW(D$12),0)=0,\"\",OFFSET(PO!O$12,ROW(D99)-ROW(D$12),0))","v":"UN"},{"$f":"IF($A99<>\"Serviço\",0,ROUND(SUMIF($F$9:$P$9,\"<>\",$F99:$P99),15-13*PO!$X$3))","v":30},30]
[{"$f":"OFFSET(PO!J$12,ROW(A100)-ROW($A$12),0)","v":"Serviço"},{"$f":"IF($A100=0,\"\",OFFSET(PO!K$12,ROW(B100)-ROW(B$12),0))","v":"2.3.0.0.6."},{"$f":"IF(OFFSET(PO!N$12,ROW(C100)-ROW(C$12),0)=0,\"\",OFFSET(PO!N$12,ROW(C100)-ROW(C$12),0))","v":"TOMADA ALTA DE EMBUTIR (1 MÓDULO), 2P+T 20 A, INCLUINDO SUPORTE E PLACA - FORNECIMENTO E INSTALAÇÃO. AF_03/2023"},{"$f":"IF(OFFSET(PO!O$12,ROW(D100)-ROW(D$12),0)=0,\"\",OFFSET(PO!O$12,ROW(D100)-ROW(D$12),0))","v":"UN"},{"$f":"IF($A100<>\"Serviço\",0,ROUND(SUMIF($F$9:$P$9,\"<>\",$F100:$P100),15-13*PO!$X$3))","v":5},5]
[{"$f":"OFFSET(PO!J$12,ROW(A101)-ROW($A$12),0)","v":"Serviço"},{"$f":"IF($A101=0,\"\",OFFSET(PO!K$12,ROW(B101)-ROW(B$12),0))","v":"2.3.0.0.7."},{"$f":"IF(OFFSET(PO!N$12,ROW(C101)-ROW(C$12),0)=0,\"\",OFFSET(PO!N$12,ROW(C101)-ROW(C$12),0))","v":"INTERRUPTOR SIMPLES (1 MÓDULO), 10A/250V, INCLUINDO SUPORTE E PLACA - FORNECIMENTO E INSTALAÇÃO. AF_03/2023"},{"$f":"IF(OFFSET(PO!O$12,ROW(D101)-ROW(D$12),0)=0,\"\",OFFSET(PO!O$12,ROW(D101)-ROW(D$12),0))","v":"UN"},{"$f":"IF($A101<>\"Serviço\",0,ROUND(SUMIF($F$9:$P$9,\"<>\",$F101:$P101),15-13*PO!$X$3))","v":10},10]
[{"$f":"OFFSET(PO!J$12,ROW(A102)-ROW($A$12),0)","v":"Serviço"},{"$f":"IF($A102=0,\"\",OFFSET(PO!K$12,ROW(B102)-ROW(B$12),0))","v":"2.3.0.0.8."},{"$f":"IF(OFFSET(PO!N$12,ROW(C102)-ROW(C$12),0)=0,\"\",OFFSET(PO!N$12,ROW(C102)-ROW(C$12),0))","v":"INTERRUPTOR SIMPLES (3 MÓDULOS), 10A/250V, INCLUINDO SUPORTE E PLACA - FORNECIMENTO E INSTALAÇÃO. AF_03/2023"},{"$f":"IF(OFFSET(PO!O$12,ROW(D102)-ROW(D$12),0)=0,\"\",OFFSET(PO!O$12,ROW(D102)-ROW(D$12),0))","v":"UN"},{"$f":"IF($A102<>\"Serviço\",0,ROUND(SUMIF($F$9:$P$9,\"<>\",$F102:$P102),15-13*PO!$X$3))","v":5},5]
[{"$f":"OFFSET(PO!J$12,ROW(A103)-ROW($A$12),0)","v":"Serviço"},{"$f":"IF($A103=0,\"\",OFFSET(PO!K$12,ROW(B103)-ROW(B$12),0))","v":"2.3.0.0.9."},{"$f":"IF(OFFSET(PO!N$12,ROW(C103)-ROW(C$12),0)=0,\"\",OFFSET(PO!N$12,ROW(C103)-ROW(C$12),0))","v":"SUPORTE PARAFUSADO COM PLACA DE ENCAIXE 4\" X 2\" BAIXO (0,30 M DO PISO) PARA PONTO ELÉTRICO - FORNECIMENTO E INSTALAÇÃO. AF_03/2023"},{"$f":"IF(OFFSET(PO!O$12,ROW(D103)-ROW(D$12),0)=0,\"\",OFFSET(PO!O$12,ROW(D103)-ROW(D$12),0))","v":"UN"},{"$f":"IF($A103<>\"Serviço\",0,ROUND(SUMIF($F$9:$P$9,\"<>\",$F103:$P103),15-13*PO!$X$3))","v":5},5]
[{"$f":"OFFSET(PO!J$12,ROW(A104)-ROW($A$12),0)","v":"Serviço"},{"$f":"IF($A104=0,\"\",OFFSET(PO!K$12,ROW(B104)-ROW(B$12),0))","v":"2.3.0.0.10."},{"$f":"IF(OFFSET(PO!N$12,ROW(C104)-ROW(C$12),0)=0,\"\",OFFSET(PO!N$12,ROW(C104)-ROW(C$12),0))","v":"CAIXA DE INSPEÇÃO PARA ATERRAMENTO, CIRCULAR, EM POLIETILENO, DIÂMETRO INTERNO = 0,3 M. AF_12/2020"},{"$f":"IF(OFFSET(PO!O$12,ROW(D104)-ROW(D$12),0)=0,\"\",OFFSET(PO!O$12,ROW(D104)-ROW(D$12),0))","v":"UN"},{"$f":"IF($A104<>\"Serviço\",0,ROUND(SUMIF($F$9:$P$9,\"<>\",$F104:$P104),15-13*PO!$X$3))","v":1},1]
[{"$f":"OFFSET(PO!J$12,ROW(A105)-ROW($A$12),0)","v":"Serviço"},{"$f":"IF($A105=0,\"\",OFFSET(PO!K$12,ROW(B105)-ROW(B$12),0))","v":"2.3.0.0.11."},{"$f":"IF(OFFSET(PO!N$12,ROW(C105)-ROW(C$12),0)=0,\"\",OFFSET(PO!N$12,ROW(C105)-ROW(C$12),0))","v":"DISPOSITIVO DR, 4 POLOS, SENSIBILIDADE DE 30 MA, CORRENTE DE 40 A, TIPO AC"},{"$f":"IF(OFFSET(PO!O$12,ROW(D105)-ROW(D$12),0)=0,\"\",OFFSET(PO!O$12,ROW(D105)-ROW(D$12),0))","v":"UN"},{"$f":"IF($A105<>\"Serviço\",0,ROUND(SUMIF($F$9:$P$9,\"<>\",$F105:$P105),15-13*PO!$X$3))","v":2},2]
[{"$f":"OFFSET(PO!J$12,ROW(A106)-ROW($A$12),0)","v":"Serviço"},{"$f":"IF($A106=0,\"\",OFFSET(PO!K$12,ROW(B106)-ROW(B$12),0))","v":"2.3.0.0.12."},{"$f":"IF(OFFSET(PO!N$12,ROW(C106)-ROW(C$12),0)=0,\"\",OFFSET(PO!N$12,ROW(C106)-ROW(C$12),0))","v":"ELETRICISTA COM ENCARGOS COMPLEMENTARES"},{"$f":"IF(OFFSET(PO!O$12,ROW(D106)-ROW(D$12),0)=0,\"\",OFFSET(PO!O$12,ROW(D106)-ROW(D$12),0))","v":"H"},{"$f":"IF($A106<>\"Serviço\",0,ROUND(SUMIF($F$9:$P$9,\"<>\",$F106:$P106),15-13*PO!$X$3))","v":16},16]
[{"$f":"OFFSET(PO!J$12,ROW(A107)-ROW($A$12),0)","v":"Nível 2"},{"$f":"IF($A107=0,\"\",OFFSET(PO!K$12,ROW(B107)-ROW(B$12),0))","v":"2.4."},{"$f":"IF(OFFSET(PO!N$12,ROW(C107)-ROW(C$12),0)=0,\"\",OFFSET(PO!N$12,ROW(C107)-ROW(C$12),0))","v":"FORRO"},{"$f":"IF(OFFSET(PO!O$12,ROW(D107)-ROW(D$12),0)=0,\"\",OFFSET(PO!O$12,ROW(D107)-ROW(D$12),0))","v":""},{"$f":"IF($A107<>\"Serviço\",0,ROUND(SUMIF($F$9:$P$9,\"<>\",$F107:$P107),15-13*PO!$X$3))","v":0}]
[{"$f":"OFFSET(PO!J$12,ROW(A108)-ROW($A$12),0)","v":"Serviço"},{"$f":"IF($A108=0,\"\",OFFSET(PO!K$12,ROW(B108)-ROW(B$12),0))","v":"2.4.0.0.1."},{"$f":"IF(OFFSET(PO!N$12,ROW(C108)-ROW(C$12),0)=0,\"\",OFFSET(PO!N$12,ROW(C108)-ROW(C$12),0))","v":"REMOÇÃO DE LUMINÁRIAS, DE FORMA MANUAL, SEM REAPROVEITAMENTO. AF_09/2023"},{"$f":"IF(OFFSET(PO!O$12,ROW(D108)-ROW(D$12),0)=0,\"\",OFFSET(PO!O$12,ROW(D108)-ROW(D$12),0))","v":"UN"},{"$f":"IF($A108<>\"Serviço\",0,ROUND(SUMIF($F$9:$P$9,\"<>\",$F108:$P108),15-13*PO!$X$3))","v":28},null,null,28]
[{"$f":"OFFSET(PO!J$12,ROW(A109)-ROW($A$12),0)","v":"Serviço"},{"$f":"IF($A109=0,\"\",OFFSET(PO!K$12,ROW(B109)-ROW(B$12),0))","v":"2.4.0.0.2."},{"$f":"IF(OFFSET(PO!N$12,ROW(C109)-ROW(C$12),0)=0,\"\",OFFSET(PO!N$12,ROW(C109)-ROW(C$12),0))","v":"REMOÇÃO DE FORRO DE GESSO, DE FORMA MANUAL, SEM REAPROVEITAMENTO. AF_09/2023"},{"$f":"IF(OFFSET(PO!O$12,ROW(D109)-ROW(D$12),0)=0,\"\",OFFSET(PO!O$12,ROW(D109)-ROW(D$12),0))","v":"M2"},{"$f":"IF($A109<>\"Serviço\",0,ROUND(SUMIF($F$9:$P$9,\"<>\",$F109:$P109),15-13*PO!$X$3))","v":244.8},{"$f":"71.91+11.21+6.3+149.75+2.76+2.87","v":244.8}]
[{"$f":"OFFSET(PO!J$12,ROW(A110)-ROW($A$12),0)","v":"Serviço"},{"$f":"IF($A110=0,\"\",OFFSET(PO!K$12,ROW(B110)-ROW(B$12),0))","v":"2.4.0.0.3."},{"$f":"IF(OFFSET(PO!N$12,ROW(C110)-ROW(C$12),0)=0,\"\",OFFSET(PO!N$12,ROW(C110)-ROW(C$12),0))","v":"TRANSPORTE HORIZONTAL MANUAL, DE COMPENSADO DE MADEIRA (UNIDADE: M2XKM). AF_07/2019"},{"$f":"IF(OFFSET(PO!O$12,ROW(D110)-ROW(D$12),0)=0,\"\",OFFSET(PO!O$12,ROW(D110)-ROW(D$12),0))","v":"M2XKM"},{"$f":"IF($A110<>\"Serviço\",0,ROUND(SUMIF($F$9:$P$9,\"<>\",$F110:$P110),15-13*PO!$X$3))","v":6.12},{"$f":"(25/1000)*F109","v":6.120000000000001}]
[{"$f":"OFFSET(PO!J$12,ROW(A111)-ROW($A$12),0)","v":"Serviço"},{"$f":"IF($A111=0,\"\",OFFSET(PO!K$12,ROW(B111)-ROW(B$12),0))","v":"2.4.0.0.4."},{"$f":"IF(OFFSET(PO!N$12,ROW(C111)-ROW(C$12),0)=0,\"\",OFFSET(PO!N$12,ROW(C111)-ROW(C$12),0))","v":"FORRO EM DRYWALL, PARA AMBIENTES COMERCIAIS, INCLUSIVE ESTRUTURA BIRECIONAL DE FIXAÇÃO. AF_08/2023_PS"},{"$f":"IF(OFFSET(PO!O$12,ROW(D111)-ROW(D$12),0)=0,\"\",OFFSET(PO!O$12,ROW(D111)-ROW(D$12),0))","v":"M2"},{"$f":"IF($A111<>\"Serviço\",0,ROUND(SUMIF($F$9:$P$9,\"<>\",$F111:$P111),15-13*PO!$X$3))","v":244.8},{"$f":"F109","v":244.8}]
[{"$f":"OFFSET(PO!J$12,ROW(A112)-ROW($A$12),0)","v":"Serviço"},{"$f":"IF($A112=0,\"\",OFFSET(PO!K$12,ROW(B112)-ROW(B$12),0))","v":"2.4.0.0.5."},{"$f":"IF(OFFSET(PO!N$12,ROW(C112)-ROW(C$12),0)=0,\"\",OFFSET(PO!N$12,ROW(C112)-ROW(C$12),0))","v":"EMASSAMENTO COM MASSA LÁTEX, APLICAÇÃO EM TETO, DUAS DEMÃOS, LIXAMENTO MANUAL. AF_04/2023"},{"$f":"IF(OFFSET(PO!O$12,ROW(D112)-ROW(D$12),0)=0,\"\",OFFSET(PO!O$12,ROW(D112)-ROW(D$12),0))","v":"M2"},{"$f":"IF($A112<>\"Serviço\",0,ROUND(SUMIF($F$9:$P$9,\"<>\",$F112:$P112),15-13*PO!$X$3))","v":244.8},{"$f":"F109","v":244.8}]
[{"$f":"OFFSET(PO!J$12,ROW(A113)-ROW($A$12),0)","v":"Serviço"},{"$f":"IF($A113=0,\"\",OFFSET(PO!K$12,ROW(B113)-ROW(B$12),0))","v":"2.4.0.0.6."},{"$f":"IF(OFFSET(PO!N$12,ROW(C113)-ROW(C$12),0)=0,\"\",OFFSET(PO!N$12,ROW(C113)-ROW(C$12),0))","v":"FUNDO SELADOR ACRÍLICO, APLICAÇÃO MANUAL EM PAREDE, UMA DEMÃO. AF_04/2023"},{"$f":"IF(OFFSET(PO!O$12,ROW(D113)-ROW(D$12),0)=0,\"\",OFFSET(PO!O$12,ROW(D113)-ROW(D$12),0))","v":"M2"},{"$f":"IF($A113<>\"Serviço\",0,ROUND(SUMIF($F$9:$P$9,\"<>\",$F113:$P113),15-13*PO!$X$3))","v":244.8},{"$f":"F109","v":244.8}]
[{"$f":"OFFSET(PO!J$12,ROW(A114)-ROW($A$12),0)","v":"Serviço"},{"$f":"IF($A114=0,\"\",OFFSET(PO!K$12,ROW(B114)-ROW(B$12),0))","v":"2.4.0.0.7."},{"$f":"IF(OFFSET(PO!N$12,ROW(C114)-ROW(C$12),0)=0,\"\",OFFSET(PO!N$12,ROW(C114)-ROW(C$12),0))","v":"PINTURA LÁTEX ACRÍLICA PREMIUM, APLICAÇÃO MANUAL EM TETO, DUAS DEMÃOS. AF_04/2023"},{"$f":"IF(OFFSET(PO!O$12,ROW(D114)-ROW(D$12),0)=0,\"\",OFFSET(PO!O$12,ROW(D114)-ROW(D$12),0))","v":"M2"},{"$f":"IF($A114<>\"Serviço\",0,ROUND(SUMIF($F$9:$P$9,\"<>\",$F114:$P114),15-13*PO!$X$3))","v":244.8},{"$f":"F109","v":244.8}]
[{"$f":"OFFSET(PO!J$12,ROW(A115)-ROW($A$12),0)","v":"Nível 2"},{"$f":"IF($A115=0,\"\",OFFSET(PO!K$12,ROW(B115)-ROW(B$12),0))","v":"2.5."},{"$f":"IF(OFFSET(PO!N$12,ROW(C115)-ROW(C$12),0)=0,\"\",OFFSET(PO!N$12,ROW(C115)-ROW(C$12),0))","v":"REVESTIMENTOS"},{"$f":"IF(OFFSET(PO!O$12,ROW(D115)-ROW(D$12),0)=0,\"\",OFFSET(PO!O$12,ROW(D115)-ROW(D$12),0))","v":""},{"$f":"IF($A115<>\"Serviço\",0,ROUND(SUMIF($F$9:$P$9,\"<>\",$F115:$P115),15-13*PO!$X$3))","v":0},0]
[{"$f":"OFFSET(PO!J$12,ROW(A116)-ROW($A$12),0)","v":"Nível 3"},{"$f":"IF($A116=0,\"\",OFFSET(PO!K$12,ROW(B116)-ROW(B$12),0))","v":"2.5.1."},{"$f":"IF(OFFSET(PO!N$12,ROW(C116)-ROW(C$12),0)=0,\"\",OFFSET(PO!N$12,ROW(C116)-ROW(C$12),0))","v":"INTERNOS"},{"$f":"IF(OFFSET(PO!O$12,ROW(D116)-ROW(D$12),0)=0,\"\",OFFSET(PO!O$12,ROW(D116)-ROW(D$12),0))","v":""},{"$f":"IF($A116<>\"Serviço\",0,ROUND(SUMIF($F$9:$P$9,\"<>\",$F116:$P116),15-13*PO!$X$3))","v":0}]
[{"$f":"OFFSET(PO!J$12,ROW(A117)-ROW($A$12),0)","v":"Serviço"},{"$f":"IF($A117=0,\"\",OFFSET(PO!K$12,ROW(B117)-ROW(B$12),0))","v":"2.5.1.0.1."},{"$f":"IF(OFFSET(PO!N$12,ROW(C117)-ROW(C$12),0)=0,\"\",OFFSET(PO!N$12,ROW(C117)-ROW(C$12),0))","v":"CHAPISCO APLICADO EM ALVENARIAS E ESTRUTURAS DE CONCRETO INTERNAS, COM COLHER DE PEDREIRO. ARGAMASSA TRAÇO 1:3 COM PREPARO EM BETONEIRA 400L. AF_10/2022"},{"$f":"IF(OFFSET(PO!O$12,ROW(D117)-ROW(D$12),0)=0,\"\",OFFSET(PO!O$12,ROW(D117)-ROW(D$12),0))","v":"M2"},{"$f":"IF($A117<>\"Serviço\",0,ROUND(SUMIF($F$9:$P$9,\"<>\",$F117:$P117),15-13*PO!$X$3))","v":105.68},null,{"$f":"G37","v":34.28},{"$f":"H37","v":71.404499999999985}]
[{"$f":"OFFSET(PO!J$12,ROW(A118)-ROW($A$12),0)","v":"Serviço"},{"$f":"IF($A118=0,\"\",OFFSET(PO!K$12,ROW(B118)-ROW(B$12),0))","v":"2.5.1.0.2."},{"$f":"IF(OFFSET(PO!N$12,ROW(C118)-ROW(C$12),0)=0,\"\",OFFSET(PO!N$12,ROW(C118)-ROW(C$12),0))","v":"EMBOÇO OU MASSA ÚNICA EM ARGAMASSA TRAÇO 1:2:8, PREPARO MECÂNICO COM BETONEIRA 400 L, APLICADA MANUALMENTE EM PANOS DE FACHADA COM PRESENÇA DE VÃOS, ESPESSURA DE 25 MM. AF_08/2022"},{"$f":"IF(OFFSET(PO!O$12,ROW(D118)-ROW(D$12),0)=0,\"\",OFFSET(PO!O$12,ROW(D118)-ROW(D$12),0))","v":"M2"},{"$f":"IF($A118<>\"Serviço\",0,ROUND(SUMIF($F$9:$P$9,\"<>\",$F118:$P118),15-13*PO!$X$3))","v":105.68},null,{"$f":"G117","v":34.28},{"$f":"H117","v":71.404499999999985}]
[{"$f":"OFFSET(PO!J$12,ROW(A119)-ROW($A$12),0)","v":"Serviço"},{"$f":"IF($A119=0,\"\",OFFSET(PO!K$12,ROW(B119)-ROW(B$12),0))","v":"2.5.1.0.3."},{"$f":"IF(OFFSET(PO!N$12,ROW(C119)-ROW(C$12),0)=0,\"\",OFFSET(PO!N$12,ROW(C119)-ROW(C$12),0))","v":"REVESTIMENTO CERÂMICO PARA PAREDES INTERNAS COM PLACAS TIPO ESMALTADA DE DIMENSÕES 25X35 CM APLICADAS NA ALTURA INTEIRA DAS PAREDES. AF_02/2023_PE"},{"$f":"IF(OFFSET(PO!O$12,ROW(D119)-ROW(D$12),0)=0,\"\",OFFSET(PO!O$12,ROW(D119)-ROW(D$12),0))","v":"M2"},{"$f":"IF($A119<>\"Serviço\",0,ROUND(SUMIF($F$9:$P$9,\"<>\",$F119:$P119),15-13*PO!$X$3))","v":22.33},null,null,{"$f":"H38","v":22.330000000000002}]
[{"$f":"OFFSET(PO!J$12,ROW(A120)-ROW($A$12),0)","v":"Serviço"},{"$f":"IF($A120=0,\"\",OFFSET(PO!K$12,ROW(B120)-ROW(B$12),0))","v":"2.5.1.0.4."},{"$f":"IF(OFFSET(PO!N$12,ROW(C120)-ROW(C$12),0)=0,\"\",OFFSET(PO!N$12,ROW(C120)-ROW(C$12),0))","v":"EMASSAMENTO COM MASSA LÁTEX, APLICAÇÃO EM PAREDE, TRÊS DEMÂOS, LIXAMENTO MANUAL"},{"$f":"IF(OFFSET(PO!O$12,ROW(D120)-ROW(D$12),0)=0,\"\",OFFSET(PO!O$12,ROW(D120)-ROW(D$12),0))","v":"M2"},{"$f":"IF($A120<>\"Serviço\",0,ROUND(SUMIF($F$9:$P$9,\"<>\",$F120:$P120),15-13*PO!$X$3))","v":105.68},null,{"$f":"G117","v":34.28},{"$f":"H117","v":71.404499999999985}]
[{"$f":"OFFSET(PO!J$12,ROW(A121)-ROW($A$12),0)","v":"Serviço"},{"$f":"IF($A121=0,\"\",OFFSET(PO!K$12,ROW(B121)-ROW(B$12),0))","v":"2.5.1.0.5."},{"$f":"IF(OFFSET(PO!N$12,ROW(C121)-ROW(C$12),0)=0,\"\",OFFSET(PO!N$12,ROW(C121)-ROW(C$12),0))","v":"FUNDO SELADOR ACRÍLICO, APLICAÇÃO MANUAL EM PAREDE, UMA DEMÃO. AF_04/2023"},{"$f":"IF(OFFSET(PO!O$12,ROW(D121)-ROW(D$12),0)=0,\"\",OFFSET(PO!O$12,ROW(D121)-ROW(D$12),0))","v":"M2"},{"$f":"IF($A121<>\"Serviço\",0,ROUND(SUMIF($F$9:$P$9,\"<>\",$F121:$P121),15-13*PO!$X$3))","v":105.68},null,{"$f":"G117","v":34.28},{"$f":"H117","v":71.404499999999985}]
[{"$f":"OFFSET(PO!J$12,ROW(A122)-ROW($A$12),0)","v":"Serviço"},{"$f":"IF($A122=0,\"\",OFFSET(PO!K$12,ROW(B122)-ROW(B$12),0))","v":"2.5.1.0.6."},{"$f":"IF(OFFSET(PO!N$12,ROW(C122)-ROW(C$12),0)=0,\"\",OFFSET(PO!N$12,ROW(C122)-ROW(C$12),0))","v":"APLICAÇÃO MANUAL DE TINTA LÁTEX ACRÍLICA EM PAREDE EXTERNAS DE CASAS, DUAS DEMÃOS. AF_03/2024"},{"$f":"IF(OFFSET(PO!O$12,ROW(D122)-ROW(D$12),0)=0,\"\",OFFSET(PO!O$12,ROW(D122)-ROW(D$12),0))","v":"M2"},{"$f":"IF($A122<>\"Serviço\",0,ROUND(SUMIF($F$9:$P$9,\"<>\",$F122:$P122),15-13*PO!$X$3))","v":533.67999999999995},null,240.58,293.10000000000002]
[{"$f":"OFFSET(PO!J$12,ROW(A123)-ROW($A$12),0)","v":"Nível 3"},{"$f":"IF($A123=0,\"\",OFFSET(PO!K$12,ROW(B123)-ROW(B$12),0))","v":"2.5.2."},{"$f":"IF(OFFSET(PO!N$12,ROW(C123)-ROW(C$12),0)=0,\"\",OFFSET(PO!N$12,ROW(C123)-ROW(C$12),0))","v":"EXTERNO"},{"$f":"IF(OFFSET(PO!O$12,ROW(D123)-ROW(D$12),0)=0,\"\",OFFSET(PO!O$12,ROW(D123)-ROW(D$12),0))","v":""},{"$f":"IF($A123<>\"Serviço\",0,ROUND(SUMIF($F$9:$P$9,\"<>\",$F123:$P123),15-13*PO!$X$3))","v":0}]
[{"$f":"OFFSET(PO!J$12,ROW(A124)-ROW($A$12),0)","v":"Serviço"},{"$f":"IF($A124=0,\"\",OFFSET(PO!K$12,ROW(B124)-ROW(B$12),0))","v":"2.5.2.0.1."},{"$f":"IF(OFFSET(PO!N$12,ROW(C124)-ROW(C$12),0)=0,\"\",OFFSET(PO!N$12,ROW(C124)-ROW(C$12),0))","v":"CHAPISCO APLICADO EM ALVENARIA (COM PRESENÇA DE VÃOS) E ESTRUTURAS DE CONCRETO DE FACHADA, COM COLHER DE PEDREIRO. ARGAMASSA TRAÇO 1:3 COM PREPARO EM BETONEIRA 400L. AF_10/2022"},{"$f":"IF(OFFSET(PO!O$12,ROW(D124)-ROW(D$12),0)=0,\"\",OFFSET(PO!O$12,ROW(D124)-ROW(D$12),0))","v":"M2"},{"$f":"IF($A124<>\"Serviço\",0,ROUND(SUMIF($F$9:$P$9,\"<>\",$F124:$P124),15-13*PO!$X$3))","v":137.4},null,{"$f":"G42","v":65.628000000000014},{"$f":"H42","v":71.775000000000006}]
[{"$f":"OFFSET(PO!J$12,ROW(A125)-ROW($A$12),0)","v":"Serviço"},{"$f":"IF($A125=0,\"\",OFFSET(PO!K$12,ROW(B125)-ROW(B$12),0))","v":"2.5.2.0.2."},{"$f":"IF(OFFSET(PO!N$12,ROW(C125)-ROW(C$12),0)=0,\"\",OFFSET(PO!N$12,ROW(C125)-ROW(C$12),0))","v":"EMBOÇO OU MASSA ÚNICA EM ARGAMASSA TRAÇO 1:2:8, PREPARO MECÂNICO COM BETONEIRA 400 L, APLICADA MANUALMENTE EM PANOS DE FACHADA COM PRESENÇA DE VÃOS, ESPESSURA DE 25 MM. AF_08/2022"},{"$f":"IF(OFFSET(PO!O$12,ROW(D125)-ROW(D$12),0)=0,\"\",OFFSET(PO!O$12,ROW(D125)-ROW(D$12),0))","v":"M2"},{"$f":"IF($A125<>\"Serviço\",0,ROUND(SUMIF($F$9:$P$9,\"<>\",$F125:$P125),15-13*PO!$X$3))","v":137.4},null,{"$f":"G124","v":65.628000000000014},{"$f":"H124","v":71.775000000000006}]
[{"$f":"OFFSET(PO!J$12,ROW(A126)-ROW($A$12),0)","v":"Serviço"},{"$f":"IF($A126=0,\"\",OFFSET(PO!K$12,ROW(B126)-ROW(B$12),0))","v":"2.5.2.0.3."},{"$f":"IF(OFFSET(PO!N$12,ROW(C126)-ROW(C$12),0)=0,\"\",OFFSET(PO!N$12,ROW(C126)-ROW(C$12),0))","v":"TEXTURA ACRÍLICA, APLICAÇÃO MANUAL EM PAREDE, UMA DEMÃO. AF_04/2023"},{"$f":"IF(OFFSET(PO!O$12,ROW(D126)-ROW(D$12),0)=0,\"\",OFFSET(PO!O$12,ROW(D126)-ROW(D$12),0))","v":"M2"},{"$f":"IF($A126<>\"Serviço\",0,ROUND(SUMIF($F$9:$P$9,\"<>\",$F126:$P126),15-13*PO!$X$3))","v":137.4},null,{"$f":"G124","v":65.628000000000014},{"$f":"H124","v":71.775000000000006}]
[{"$f":"OFFSET(PO!J$12,ROW(A127)-ROW($A$12),0)","v":"Serviço"},{"$f":"IF($A127=0,\"\",OFFSET(PO!K$12,ROW(B127)-ROW(B$12),0))","v":"2.5.2.0.4."},{"$f":"IF(OFFSET(PO!N$12,ROW(C127)-ROW(C$12),0)=0,\"\",OFFSET(PO!N$12,ROW(C127)-ROW(C$12),0))","v":"FUNDO SELADOR ACRÍLICO, APLICAÇÃO MANUAL EM PAREDE, UMA DEMÃO. AF_04/2023"},{"$f":"IF(OFFSET(PO!O$12,ROW(D127)-ROW(D$12),0)=0,\"\",OFFSET(PO!O$12,ROW(D127)-ROW(D$12),0))","v":"M2"},{"$f":"IF($A127<>\"Serviço\",0,ROUND(SUMIF($F$9:$P$9,\"<>\",$F127:$P127),15-13*PO!$X$3))","v":137.4},null,{"$f":"G124","v":65.628000000000014},{"$f":"H124","v":71.775000000000006}]
[{"$f":"OFFSET(PO!J$12,ROW(A128)-ROW($A$12),0)","v":"Serviço"},{"$f":"IF($A128=0,\"\",OFFSET(PO!K$12,ROW(B128)-ROW(B$12),0))","v":"2.5.2.0.5."},{"$f":"IF(OFFSET(PO!N$12,ROW(C128)-ROW(C$12),0)=0,\"\",OFFSET(PO!N$12,ROW(C128)-ROW(C$12),0))","v":"APLICAÇÃO MANUAL DE TINTA LÁTEX ACRÍLICA EM PAREDE EXTERNAS DE CASAS, DUAS DEMÃOS. AF_03/2024"},{"$f":"IF(OFFSET(PO!O$12,ROW(D128)-ROW(D$12),0)=0,\"\",OFFSET(PO!O$12,ROW(D128)-ROW(D$12),0))","v":"M2"},{"$f":"IF($A128<>\"Serviço\",0,ROUND(SUMIF($F$9:$P$9,\"<>\",$F128:$P128),15-13*PO!$X$3))","v":408.99},null,197.88,211.11]
[{"$f":"OFFSET(PO!J$12,ROW(A129)-ROW($A$12),0)","v":"Nível 2"},{"$f":"IF($A129=0,\"\",OFFSET(PO!K$12,ROW(B129)-ROW(B$12),0))","v":"2.6."},{"$f":"IF(OFFSET(PO!N$12,ROW(C129)-ROW(C$12),0)=0,\"\",OFFSET(PO!N$12,ROW(C129)-ROW(C$12),0))","v":"PAVIMENTAÇÃO"},{"$f":"IF(OFFSET(PO!O$12,ROW(D129)-ROW(D$12),0)=0,\"\",OFFSET(PO!O$12,ROW(D129)-ROW(D$12),0))","v":""},{"$f":"IF($A129<>\"Serviço\",0,ROUND(SUMIF($F$9:$P$9,\"<>\",$F129:$P129),15-13*PO!$X$3))","v":0}]
[{"$f":"OFFSET(PO!J$12,ROW(A130)-ROW($A$12),0)","v":"Serviço"},{"$f":"IF($A130=0,\"\",OFFSET(PO!K$12,ROW(B130)-ROW(B$12),0))","v":"2.6.0.0.1."},{"$f":"IF(OFFSET(PO!N$12,ROW(C130)-ROW(C$12),0)=0,\"\",OFFSET(PO!N$12,ROW(C130)-ROW(C$12),0))","v":"DEMOLIÇÃO DE REVESTIMENTO CERÂMICO, DE FORMA MECANIZADA COM MARTELETE, SEM REAPROVEITAMENTO. AF_09/2023"},{"$f":"IF(OFFSET(PO!O$12,ROW(D130)-ROW(D$12),0)=0,\"\",OFFSET(PO!O$12,ROW(D130)-ROW(D$12),0))","v":"M2"},{"$f":"IF($A130<>\"Serviço\",0,ROUND(SUMIF($F$9:$P$9,\"<>\",$F130:$P130),15-13*PO!$X$3))","v":475.56},null,{"$f":"26.89+152.23+22.47+11.1+11.04+12.99+9.57","v":246.29},{"$f":"56.38+11.21+6.3+149.75+2.76+2.87","v":229.26999999999998}]
[{"$f":"OFFSET(PO!J$12,ROW(A131)-ROW($A$12),0)","v":"Serviço"},{"$f":"IF($A131=0,\"\",OFFSET(PO!K$12,ROW(B131)-ROW(B$12),0))","v":"2.6.0.0.2."},{"$f":"IF(OFFSET(PO!N$12,ROW(C131)-ROW(C$12),0)=0,\"\",OFFSET(PO!N$12,ROW(C131)-ROW(C$12),0))","v":"DEMOLIÇÃO DE RODAPÉ CERÂMICO, DE FORMA MANUAL, SEM REAPROVEITAMENTO. AF_09/2023"},{"$f":"IF(OFFSET(PO!O$12,ROW(D131)-ROW(D$12),0)=0,\"\",OFFSET(PO!O$12,ROW(D131)-ROW(D$12),0))","v":"M"},{"$f":"IF($A131<>\"Serviço\",0,ROUND(SUMIF($F$9:$P$9,\"<>\",$F131:$P131),15-13*PO!$X$3))","v":193.03},null,{"$f":"13.1+12.18+(37.61-18.81)+3+7.16+18.33+2.22+0.84+3.23+5.13+1.86+(1.36*5)+(3*2)","v":98.649999999999991},{"$f":"37+7.64+43.1+2.44+4.2","v":94.38000000000001}]
[{"$f":"OFFSET(PO!J$12,ROW(A132)-ROW($A$12),0)","v":"Serviço"},{"$f":"IF($A132=0,\"\",OFFSET(PO!K$12,ROW(B132)-ROW(B$12),0))","v":"2.6.0.0.3."},{"$f":"IF(OFFSET(PO!N$12,ROW(C132)-ROW(C$12),0)=0,\"\",OFFSET(PO!N$12,ROW(C132)-ROW(C$12),0))","v":"DEMOLIÇÃO DE PISO DE CONCRETO SIMPLES, DE FORMA MECANIZADA COM MARTELETE, SEM REAPROVEITAMENTO. AF_09/2023"},{"$f":"IF(OFFSET(PO!O$12,ROW(D132)-ROW(D$12),0)=0,\"\",OFFSET(PO!O$12,ROW(D132)-ROW(D$12),0))","v":"M3"},{"$f":"IF($A132<>\"Serviço\",0,ROUND(SUMIF($F$9:$P$9,\"<>\",$F132:$P132),15-13*PO!$X$3))","v":0.23},null,{"$f":"18.81*0.4*0.03","v":0.22572}]
[{"$f":"OFFSET(PO!J$12,ROW(A133)-ROW($A$12),0)","v":"Serviço"},{"$f":"IF($A133=0,\"\",OFFSET(PO!K$12,ROW(B133)-ROW(B$12),0))","v":"2.6.0.0.4."},{"$f":"IF(OFFSET(PO!N$12,ROW(C133)-ROW(C$12),0)=0,\"\",OFFSET(PO!N$12,ROW(C133)-ROW(C$12),0))","v":"DEMOLIÇÃO DE ARGAMASSAS, DE FORMA DE FORMA MECANIZADA COM MARTELETE, SEM REAPROVEITAMENTO. AF_09/2023"},{"$f":"IF(OFFSET(PO!O$12,ROW(D133)-ROW(D$12),0)=0,\"\",OFFSET(PO!O$12,ROW(D133)-ROW(D$12),0))","v":"M2"},{"$f":"IF($A133<>\"Serviço\",0,ROUND(SUMIF($F$9:$P$9,\"<>\",$F133:$P133),15-13*PO!$X$3))","v":22.57},null,{"$f":"18.81*1.2","v":22.571999999999999}]
[{"$f":"OFFSET(PO!J$12,ROW(A134)-ROW($A$12),0)","v":"Serviço"},{"$f":"IF($A134=0,\"\",OFFSET(PO!K$12,ROW(B134)-ROW(B$12),0))","v":"2.6.0.0.5."},{"$f":"IF(OFFSET(PO!N$12,ROW(C134)-ROW(C$12),0)=0,\"\",OFFSET(PO!N$12,ROW(C134)-ROW(C$12),0))","v":"REBOCO IMPERMEÁVEL E=3CM"},{"$f":"IF(OFFSET(PO!O$12,ROW(D134)-ROW(D$12),0)=0,\"\",OFFSET(PO!O$12,ROW(D134)-ROW(D$12),0))","v":"M2"},{"$f":"IF($A134<>\"Serviço\",0,ROUND(SUMIF($F$9:$P$9,\"<>\",$F134:$P134),15-13*PO!$X$3))","v":30.1},null,{"$f":"(18.81*0.4)+(18.81*1.2)","v":30.096}]
[{"$f":"OFFSET(PO!J$12,ROW(A135)-ROW($A$12),0)","v":"Serviço"},{"$f":"IF($A135=0,\"\",OFFSET(PO!K$12,ROW(B135)-ROW(B$12),0))","v":"2.6.0.0.6."},{"$f":"IF(OFFSET(PO!N$12,ROW(C135)-ROW(C$12),0)=0,\"\",OFFSET(PO!N$12,ROW(C135)-ROW(C$12),0))","v":"REVESTIMENTO CERÂMICO PARA PISO COM PLACAS TIPO PORCELANATO DE DIMENSÕES 80X80 CM APLICADA EM AMBIENTES DE ÁREA MAIOR QUE 10 M². AF_02/2023_PE"},{"$f":"IF(OFFSET(PO!O$12,ROW(D135)-ROW(D$12),0)=0,\"\",OFFSET(PO!O$12,ROW(D135)-ROW(D$12),0))","v":"M2"},{"$f":"IF($A135<>\"Serviço\",0,ROUND(SUMIF($F$9:$P$9,\"<>\",$F135:$P135),15-13*PO!$X$3))","v":475.56},null,{"$f":"G130","v":246.29},{"$f":"H130","v":229.26999999999998}]
[{"$f":"OFFSET(PO!J$12,ROW(A136)-ROW($A$12),0)","v":"Serviço"},{"$f":"IF($A136=0,\"\",OFFSET(PO!K$12,ROW(B136)-ROW(B$12),0))","v":"2.6.0.0.7."},{"$f":"IF(OFFSET(PO!N$12,ROW(C136)-ROW(C$12),0)=0,\"\",OFFSET(PO!N$12,ROW(C136)-ROW(C$12),0))","v":"RODAPÉ CERÂMICO DE 7CM DE ALTURA COM PLACAS TIPO ESMALTADA DE DIMENSÕES 80X80CM. AF_02/2023"},{"$f":"IF(OFFSET(PO!O$12,ROW(D136)-ROW(D$12),0)=0,\"\",OFFSET(PO!O$12,ROW(D136)-ROW(D$12),0))","v":"M"},{"$f":"IF($A136<>\"Serviço\",0,ROUND(SUMIF($F$9:$P$9,\"<>\",$F136:$P136),15-13*PO!$X$3))","v":193.03},null,{"$f":"G131","v":98.649999999999991},{"$f":"H131","v":94.38000000000001}]
[{"$f":"OFFSET(PO!J$12,ROW(A137)-ROW($A$12),0)","v":"Meta"},{"$f":"IF($A137=0,\"\",OFFSET(PO!K$12,ROW(B137)-ROW(B$12),0))","v":"3."},{"$f":"IF(OFFSET(PO!N$12,ROW(C137)-ROW(C$12),0)=0,\"\",OFFSET(PO!N$12,ROW(C137)-ROW(C$12),0))","v":"LOTE 2 - FACHADA EM ACM 1ª ETAPA"},{"$f":"IF(OFFSET(PO!O$12,ROW(D137)-ROW(D$12),0)=0,\"\",OFFSET(PO!O$12,ROW(D137)-ROW(D$12),0))","v":""},{"$f":"IF($A137<>\"Serviço\",0,ROUND(SUMIF($F$9:$P$9,\"<>\",$F137:$P137),15-13*PO!$X$3))","v":0}]
[{"$f":"OFFSET(PO!J$12,ROW(A138)-ROW($A$12),0)","v":"Nível 3"},{"$f":"IF($A138=0,\"\",OFFSET(PO!K$12,ROW(B138)-ROW(B$12),0))","v":"3.0.1."},{"$f":"IF(OFFSET(PO!N$12,ROW(C138)-ROW(C$12),0)=0,\"\",OFFSET(PO!N$12,ROW(C138)-ROW(C$12),0))","v":"PLATIBANDA"},{"$f":"IF(OFFSET(PO!O$12,ROW(D138)-ROW(D$12),0)=0,\"\",OFFSET(PO!O$12,ROW(D138)-ROW(D$12),0))","v":""},{"$f":"IF($A138<>\"Serviço\",0,ROUND(SUMIF($F$9:$P$9,\"<>\",$F138:$P138),15-13*PO!$X$3))","v":0}]
[{"$f":"OFFSET(PO!J$12,ROW(A139)-ROW($A$12),0)","v":"Serviço"},{"$f":"IF($A139=0,\"\",OFFSET(PO!K$12,ROW(B139)-ROW(B$12),0))","v":"3.0.1.0.1."},{"$f":"IF(OFFSET(PO!N$12,ROW(C139)-ROW(C$12),0)=0,\"\",OFFSET(PO!N$12,ROW(C139)-ROW(C$12),0))","v":"FACHADA - ACM 3MM (PLATIBANDA, SACADA E DETALHE LATERAL), INCLUSO TESTEIRAS E ESTRUTURA METÁLICA NECESSÁRIA - FORNECIMENTO E INSTALAÇÃO"},{"$f":"IF(OFFSET(PO!O$12,ROW(D139)-ROW(D$12),0)=0,\"\",OFFSET(PO!O$12,ROW(D139)-ROW(D$12),0))","v":"M2"},{"$f":"IF($A139<>\"Serviço\",0,ROUND(SUMIF($F$9:$P$9,\"<>\",$F139:$P139),15-13*PO!$X$3))","v":178.56},{"$f":"F140+(F140*0.5)","v":178.56}]
[{"$f":"OFFSET(PO!J$12,ROW(A140)-ROW($A$12),0)","v":"Serviço"},{"$f":"IF($A140=0,\"\",OFFSET(PO!K$12,ROW(B140)-ROW(B$12),0))","v":"3.0.1.0.2."},{"$f":"IF(OFFSET(PO!N$12,ROW(C140)-ROW(C$12),0)=0,\"\",OFFSET(PO!N$12,ROW(C140)-ROW(C$12),0))","v":"TELHAMENTO COM TELHA DE AÇO/ALUMÍNIO E = 0,5 MM, COM ATÉ 2 ÁGUAS, INCLUSO IÇAMENTO. AF_07/2019"},{"$f":"IF(OFFSET(PO!O$12,ROW(D140)-ROW(D$12),0)=0,\"\",OFFSET(PO!O$12,ROW(D140)-ROW(D$12),0))","v":"M2"},{"$f":"IF($A140<>\"Serviço\",0,ROUND(SUMIF($F$9:$P$9,\"<>\",$F140:$P140),15-13*PO!$X$3))","v":119.04},{"$f":"(79.36*1.5)","v":119.03999999999999}]
[{"$f":"OFFSET(PO!J$12,ROW(A141)-ROW($A$12),0)","v":"Nível 3"},{"$f":"IF($A141=0,\"\",OFFSET(PO!K$12,ROW(B141)-ROW(B$12),0))","v":"3.0.2."},{"$f":"IF(OFFSET(PO!N$12,ROW(C141)-ROW(C$12),0)=0,\"\",OFFSET(PO!N$12,ROW(C141)-ROW(C$12),0))","v":"SACADA"},{"$f":"IF(OFFSET(PO!O$12,ROW(D141)-ROW(D$12),0)=0,\"\",OFFSET(PO!O$12,ROW(D141)-ROW(D$12),0))","v":""},{"$f":"IF($A141<>\"Serviço\",0,ROUND(SUMIF($F$9:$P$9,\"<>\",$F141:$P141),15-13*PO!$X$3))","v":0}]
[{"$f":"OFFSET(PO!J$12,ROW(A142)-ROW($A$12),0)","v":"Serviço"},{"$f":"IF($A142=0,\"\",OFFSET(PO!K$12,ROW(B142)-ROW(B$12),0))","v":"3.0.2.0.1."},{"$f":"IF(OFFSET(PO!N$12,ROW(C142)-ROW(C$12),0)=0,\"\",OFFSET(PO!N$12,ROW(C142)-ROW(C$12),0))","v":"FACHADA - ACM 3MM (PLATIBANDA, SACADA E DETALHE LATERAL), INCLUSO TESTEIRAS E ESTRUTURA METÁLICA NECESSÁRIA - FORNECIMENTO E INSTALAÇÃO"},{"$f":"IF(OFFSET(PO!O$12,ROW(D142)-ROW(D$12),0)=0,\"\",OFFSET(PO!O$12,ROW(D142)-ROW(D$12),0))","v":"M2"},{"$f":"IF($A142<>\"Serviço\",0,ROUND(SUMIF($F$9:$P$9,\"<>\",$F142:$P142),15-13*PO!$X$3))","v":22.58},{"$f":"18.82*1.2","v":22.584}]
[{"$f":"OFFSET(PO!J$12,ROW(A143)-ROW($A$12),0)","v":"Nível 3"},{"$f":"IF($A143=0,\"\",OFFSET(PO!K$12,ROW(B143)-ROW(B$12),0))","v":"3.0.3."},{"$f":"IF(OFFSET(PO!N$12,ROW(C143)-ROW(C$12),0)=0,\"\",OFFSET(PO!N$12,ROW(C143)-ROW(C$12),0))","v":"DETALHE LATERAL"},{"$f":"IF(OFFSET(PO!O$12,ROW(D143)-ROW(D$12),0)=0,\"\",OFFSET(PO!O$12,ROW(D143)-ROW(D$12),0))","v":""},{"$f":"IF($A143<>\"Serviço\",0,ROUND(SUMIF($F$9:$P$9,\"<>\",$F143:$P143),15-13*PO!$X$3))","v":0}]
[{"$f":"OFFSET(PO!J$12,ROW(A144)-ROW($A$12),0)","v":"Serviço"},{"$f":"IF($A144=0,\"\",OFFSET(PO!K$12,ROW(B144)-ROW(B$12),0))","v":"3.0.3.0.1."},{"$f":"IF(OFFSET(PO!N$12,ROW(C144)-ROW(C$12),0)=0,\"\",OFFSET(PO!N$12,ROW(C144)-ROW(C$12),0))","v":"FACHADA - ACM 3MM (PLATIBANDA, SACADA E DETALHE LATERAL), INCLUSO TESTEIRAS E ESTRUTURA METÁLICA NECESSÁRIA - FORNECIMENTO E INSTALAÇÃO"},{"$f":"IF(OFFSET(PO!O$12,ROW(D144)-ROW(D$12),0)=0,\"\",OFFSET(PO!O$12,ROW(D144)-ROW(D$12),0))","v":"M2"},{"$f":"IF($A144<>\"Serviço\",0,ROUND(SUMIF($F$9:$P$9,\"<>\",$F144:$P144),15-13*PO!$X$3))","v":28},{"$f":"(1.5+1.5+0.5+0.5)*7","v":28}]
[]
[]
[null,{"$f":"PO!$K$156","v":"SÃO JOSÉ DO OURO / RS"}]
[null,"Local"]
[]
[null,{"$f":"PO!$K$159","v":"2025-11-02"}]
[null,"Data"]

{"sheet":"CFF","index":7,"n_rows":75,"n_cols":29,"rows_kept":75,"cut":false,"hidden":false,"merged":[[62,11,64,11],[62,12,64,12],[62,13,64,13],[56,11,58,11],[56,12,58,12],[56,13,58,13],[59,11,61,11],[59,12,61,12],[59,13,61,13],[50,11,52,11],[50,12,52,12],[50,13,52,13],[53,11,55,11],[53,12,55,12],[53,13,55,13],[44,11,46,11],[44,12,46,12],[44,13,46,13],[47,11,49,11],[47,12,49,12],[47,13,49,13],[38,11,40,11],[38,12,40,12],[38,13,40,13],[41,11,43,11],[41,12,43,12],[41,13,43,13],[72,16,72,18],[72,12,72,13],[71,16,71,18],[70,16,70,18],[70,11,70,13],[71,12,71,13],[32,12,34,12],[32,13,34,13],[35,11,37,11],[7,11,7,12],[10,13,12,13],[17,12,19,12],[17,13,19,13],[20,11,22,11],[20,12,22,12],[20,13,22,13],[23,11,25,11],[23,12,25,12],[23,13,25,13],[35,12,37,12],[35,13,37,13],[65,11,67,11],[65,12,67,12],[65,13,67,13],[73,11,73,13],[10,11,12,11],[10,12,12,12],[13,11,16,12],[13,13,16,13],[17,11,19,11],[26,11,28,11],[26,12,28,12],[26,13,28,13],[29,11,31,11],[29,12,31,12],[29,13,31,13],[32,11,34,11]]}
[null,null,null,null,null,null,null,null,null,null,null,null,null,null,"    CFF -","CRONOGRAMA FÍSICO-FINANCEIRO"]
[null,null,null,null,null,null,null,null,null,null,null,null,null,null,null,{"$f":"CHOOSE(1+LOG(1+2*(TipoOrçamento=\"BASE\")+4*(TipoOrçamento=\"LICITADO\")+8*(TipoOrçamento=\"REPROGRAMADOAC\")+16*(TipoOrçamento=\"REPROGRAMADONPL\"),2),\"nada\",\"Cronograma Base para Licitação\",\"Cronograma Licitado\",\"Cronograma Licitado Reprogramado\",\"Cronograma Base para Licitação - Reprogramado\")","v":"Cronograma Base para Licitação"}]
[]
[]
[]
[]
[]
["Nível Máx Crono",null,null,null,null,null,null,null,null,null,null,{"$f":"IF(MAX($A$14:$A$70)<>MAX(PO!$V$12:$V$145),\"ERRO: CRONOGRAMA DESATUALIZADO\",IF(OR(COUNTIF($O$16:$X$16,\">1\")>0,OFFSET($X$17,0,-1)<>$N$14),\"ERRO: CRONOGRAMA NÃO FECHA EM 100%\",\"\"))","v":""},null,{"$f":"IF(TipoOrçamento=\"REPROGRAMADOAC\",\"Qtde de Medições realizadas\",\"\")","v":""}]
[2,null,null,null,null,null,null,null,null,null,null,null,null,1,{"$f":"IF(AND(TipoOrçamento=\"REPROGRAMADOAC\",$N$9>0),$N$9-1,0)","v":0},{"$f":"OFFSET(P9,0,-1)+1","v":1},2,3,4,5,6,7,8,null,null,null,null,null,{"$f":"OFFSET(AC9,0,-1)+1","v":1}]
["Lista Crono","Último Nível","Nível","Altura","N1","N2","N3","N4","Czero","Cnível","VTOTAL SOMA","Item","Descrição das Metas / Macrosserviços","Valores Totais (R$)",{"$f":"IF(TipoOrçamento=\"REPROGRAMADOAC\",\"Reinício de Obra\",\"Início de Obra\")&CHAR(10)&TEXT(DADOS!A48,\"dd/mm/aa\")","v":"Início de Obra\n30/11/25"},{"$f":"IF(AND(TipoOrçamento=\"REPROGRAMADOAC\",$N$9>0,N10=\"Valores Totais (R$)\"),\"Parcela \"&$N$9&\" Executado\",\"Parcela \"&P$9&CHAR(10)&TEXT(DATE(YEAR(DADOS!$A$48),MONTH(DADOS!$A$48)+P$9-IF(AND(TipoOrçamento=\"REPROGRAMADOAC\",$N$9>0),$N$9,0),1),\"mmm/aa\"))","v":"Parcela 1\ndez/25"},{"$f":"IF(AND(TipoOrçamento=\"REPROGRAMADOAC\",$N$9>0,O10=\"Valores Totais (R$)\"),\"Parcela \"&$N$9&\" Executado\",\"Parcela \"&Q$9&CHAR(10)&TEXT(DATE(YEAR(DADOS!$A$48),MONTH(DADOS!$A$48)+Q$9-IF(AND(TipoOrçamento=\"REPROGRAMADOAC\",$N$9>0),$N$9,0),1),\"mmm/aa\"))","v":"Parcela 2\njan/26"},{"$f":"IF(AND(TipoOrçamento=\"REPROGRAMADOAC\",$N$9>0,P10=\"Valores Totais (R$)\"),\"Parcela \"&$N$9&\" Executado\",\"Parcela \"&R$9&CHAR(10)&TEXT(DATE(YEAR(DADOS!$A$48),MONTH(DADOS!$A$48)+R$9-IF(AND(TipoOrçamento=\"REPROGRAMADOAC\",$N$9>0),$N$9,0),1),\"mmm/aa\"))","v":"Parcela 3\nfev/26"},{"$f":"IF(AND(TipoOrçamento=\"REPROGRAMADOAC\",$N$9>0,Q10=\"Valores Totais (R$)\"),\"Parcela \"&$N$9&\" Executado\",\"Parcela \"&S$9&CHAR(10)&TEXT(DATE(YEAR(DADOS!$A$48),MONTH(DADOS!$A$48)+S$9-IF(AND(TipoOrçamento=\"REPROGRAMADOAC\",$N$9>0),$N$9,0),1),\"mmm/aa\"))","v":"Parcela 4\nmar/26"},{"$f":"IF(AND(TipoOrçamento=\"REPROGRAMADOAC\",$N$9>0,R10=\"Valores Totais (R$)\"),\"Parcela \"&$N$9&\" Executado\",\"Parcela \"&T$9&CHAR(10)&TEXT(DATE(YEAR(DADOS!$A$48),MONTH(DADOS!$A$48)+T$9-IF(AND(TipoOrçamento=\"REPROGRAMADOAC\",$N$9>0),$N$9,0),1),\"mmm/aa\"))","v":"Parcela 5\nabr/26"},{"$f":"IF(AND(TipoOrçamento=\"REPROGRAMADOAC\",$N$9>0,S10=\"Valores Totais (R$)\"),\"Parcela \"&$N$9&\" Executado\",\"Parcela \"&U$9&CHAR(10)&TEXT(DATE(YEAR(DADOS!$A$48),MONTH(DADOS!$A$48)+U$9-IF(AND(TipoOrçamento=\"REPROGRAMADOAC\",$N$9>0),$N$9,0),1),\"mmm/aa\"))","v":"Parcela 6\nmai/26"},{"$f":"IF(AND(TipoOrçamento=\"REPROGRAMADOAC\",$N$9>0,T10=\"Valores Totais (R$)\"),\"Parcela \"&$N$9&\" Executado\",\"Parcela \"&V$9&CHAR(10)&TEXT(DATE(YEAR(DADOS!$A$48),MONTH(DADOS!$A$48)+V$9-IF(AND(TipoOrçamento=\"REPROGRAMADOAC\",$N$9>0),$N$9,0),1),\"mmm/aa\"))","v":"Parcela 7\njun/26"},{"$f":"IF(AND(TipoOrçamento=\"REPROGRAMADOAC\",$N$9>0,U10=\"Valores Totais (R$)\"),\"Parcela \"&$N$9&\" Executado\",\"Parcela \"&W$9&CHAR(10)&TEXT(DATE(YEAR(DADOS!$A$48),MONTH(DADOS!$A$48)+W$9-IF(AND(TipoOrçamento=\"REPROGRAMADOAC\",$N$9>0),$N$9,0),1),\"mmm/aa\"))","v":"Parcela 8\njul/26"},null,null,null,null,null,{"$f":"IF(AND(TipoOrçamento=\"REPROGRAMADOAC\",$N$9>0,AA10=\"Valores Totais (R$)\"),\"Parcela \"&$N$9&\" Executado\",\"Parcela \"&AC$9&CHAR(10)&TEXT(DATE(YEAR(DADOS!$A$48),MONTH(DADOS!$A$48)+AC$9-IF(AND(TipoOrçamento=\"REPROGRAMADOAC\",$N$9>0),$N$9,0),1),\"mmm/aa\"))","v":"Parcela 1\ndez/25"}]
[null,null,null,null,null,null,null,null,null,null,null,{"$f":"INDEX(PO!K$12:K$145,MATCH($A13,PO!$V$12:$V$145,0))","v":{"$error":"#VALUE!"}},{"$f":"INDEX(PO!N$12:N$145,MATCH($A13,PO!$V$12:$V$145,0))","v":{"$error":"#VALUE!"}},{"$f":"IF(ROUND(K13,2)=0,K13,ROUND(K13,2))","v":{"$error":"#VALUE!"}},"Parcela (%)",{"$f":"IF($B13,0,P12-IF(ISNUMBER(O12),O12,0))","v":{"$error":"#VALUE!"}},{"$f":"IF($B13,0,Q12-IF(ISNUMBER(P12),P12,0))","v":{"$error":"#VALUE!"}},{"$error":"#VALUE!"},{"$error":"#VALUE!"},{"$error":"#VALUE!"},{"$error":"#VALUE!"},{"$error":"#VALUE!"},{"$error":"#VALUE!"},null,null,null,null,null,{"$f":"IF($B13,0,AC12-IF(ISNUMBER(AB12),AB12,0))","v":{"$error":"#VALUE!"}}]
[null,null,null,null,null,null,null,null,null,null,null,null,null,null,"Acumulado (%)",{"$f":"MIN(IF($B13,P11+IF(ISNUMBER(O12),O12,0),P13/$N11),1)","v":{"$error":"#VALUE!"}},{"$f":"MIN(IF($B13,Q11+IF(ISNUMBER(P12),P12,0),Q13/$N11),1)","v":{"$error":"#VALUE!"}},{"$error":"#VALUE!"},{"$error":"#VALUE!"},{"$error":"#VALUE!"},{"$error":"#VALUE!"},{"$error":"#VALUE!"},{"$error":"#VALUE!"},null,null,null,null,null,{"$f":"MIN(IF($B13,AC11+IF(ISNUMBER(AB12),AB12,0),AC13/$N11),1)","v":{"$error":"#VALUE!"}}]
[{"$f":"OFFSET(A13,-CFF.NumLinha,0)+1","v":{"$error":"#VALUE!"}},{"$f":"$C13>=OFFSET($C13,CFF.NumLinha,0)","v":{"$error":"#VALUE!"}},{"$f":"INDEX(PO!A$12:A$145,MATCH($A13,PO!$V$12:$V$145,0))","v":{"$error":"#VALUE!"}},{"$f":"IF(ISERROR(J13),I13,SMALL(I13:J13,1))-1","v":{"$error":"#VALUE!"}},{"$f":"IF($C13=1,OFFSET(E13,-CFF.NumLinha,0)+1,OFFSET(E13,-CFF.NumLinha,0))","v":{"$error":"#VALUE!"}},{"$f":"IF($C13=1,0,IF($C13=2,OFFSET(F13,-CFF.NumLinha,0)+1,OFFSET(F13,-CFF.NumLinha,0)))","v":{"$error":"#VALUE!"}},{"$f":"IF(AND($C13<=2,$C13<>0),0,IF($C13=3,OFFSET(G13,-CFF.NumLinha,0)+1,OFFSET(G13,-CFF.NumLinha,0)))","v":{"$error":"#VALUE!"}},{"$f":"IF(AND($C13<=3,$C13<>0),0,IF($C13=4,OFFSET(H13,-CFF.NumLinha,0)+1,OFFSET(H13,-CFF.NumLinha,0)))","v":{"$error":"#VALUE!"}},{"$f":"MATCH(0,OFFSET($D13,1,$C13,ROW($A$69)-ROW($A13)),0)","v":{"$error":"#VALUE!"}},{"$f":"MATCH(OFFSET($D13,0,$C13)+1,OFFSET($D13,1,$C13,ROW($A$69)-ROW($A13)),0)","v":{"$error":"#VALUE!"}},{"$f":"ROUND(INDEX(PO!T$12:T$145,MATCH($A13,PO!$V$12:$V$145,0)),2)+10^-12","v":{"$error":"#VALUE!"}},null,null,null,"Acumulado (R$)",{"$f":"IF($B13,ROUND(P12*$N11,2),ROUND(SUMIF(OFFSET($B13,1,0,$D13),TRUE,OFFSET(P13,1,0,$D13))/SUMIF(OFFSET($B13,1,0,$D13),TRUE,OFFSET($K13,1,0,$D13))*$N11,2))","v":{"$error":"#VALUE!"}},{"$f":"IF($B13,ROUND(Q12*$N11,2),ROUND(SUMIF(OFFSET($B13,1,0,$D13),TRUE,OFFSET(Q13,1,0,$D13))/SUMIF(OFFSET($B13,1,0,$D13),TRUE,OFFSET($K13,1,0,$D13))*$N11,2))","v":{"$error":"#VALUE!"}},{"$error":"#VALUE!"},{"$error":"#VALUE!"},{"$error":"#VALUE!"},{"$error":"#VALUE!"},{"$error":"#VALUE!"},{"$error":"#VALUE!"},null,null,null,null,null,{"$f":"IF($B13,ROUND(AC12*$N11,2),ROUND(SUMIF(OFFSET($B13,1,0,$D13),TRUE,OFFSET(AC13,1,0,$D13))/SUMIF(OFFSET($B13,1,0,$D13),TRUE,OFFSET($K13,1,0,$D13))*$N11,2))","v":{"$error":"#VALUE!"}}]
[null,null,null,null,null,null,null,null,null,null,null,"CRONOGRAMA GLOBAL DO LOTE",null,{"$f":"IF(PO!$T$12=0,10^-12,PO!$T$12)","v":551458.10000000009},"Parcela (%)",{"$f":"ROUND(P15/$N14,4)","v":0.26440000000000002},{"$f":"ROUND(Q15/$N14,4)","v":0.1164},0.1406,0,0,9.2100000000000001E-2,9.9699999999999997E-2,0.28670000000000001,null,null,null,null,null,{"$f":"ROUND(AC15/$N14,4)","v":0}]
[null,null,null,null,null,null,null,null,null,null,null,null,null,null,"Parcela (R$)",{"$f":"P17-IF(ISNUMBER(O17),O17,0)","v":145822.48000000001},{"$f":"Q17-IF(ISNUMBER(P17),P17,0)","v":64187.380000000005},77524.579999999987,0,0,50795.820000000007,55005.789999999979,158122.04999999999,null,null,null,null,null,{"$f":"AC17-IF(ISNUMBER(AB17),AB17,0)","v":0}]
[null,null,null,null,null,null,null,null,null,null,null,null,null,null,"Acumulado (%)",{"$f":"ROUND(P17/$N14,4)","v":0.26440000000000002},{"$f":"ROUND(Q17/$N14,4)","v":0.38080000000000003},0.52139999999999997,0.52139999999999997,0.52139999999999997,0.61350000000000005,0.71330000000000005,1,null,null,null,null,null,{"$f":"ROUND(AC17/$N14,4)","v":0}]
[0,null,null,{"$f":"ROW(D$69)-ROW(D18)","v":51},null,null,null,null,null,null,null,null,null,null,"Acumulado (R$)",{"$f":"SUMIF(OFFSET($C17,1,0):$C$69,1,OFFSET(P17,1,0):P$69)","v":145822.48000000001},{"$f":"SUMIF(OFFSET($C17,1,0):$C$69,1,OFFSET(Q17,1,0):Q$69)","v":210009.86000000002},{"$f":"SUMIF(OFFSET($C17,1,0):$C$69,1,OFFSET(R17,1,0):R$69)","v":287534.44},{"$f":"SUMIF(OFFSET($C17,1,0):$C$69,1,OFFSET(S17,1,0):S$69)","v":287534.44},{"$f":"SUMIF(OFFSET($C17,1,0):$C$69,1,OFFSET(T17,1,0):T$69)","v":287534.44},{"$f":"SUMIF(OFFSET($C17,1,0):$C$69,1,OFFSET(U17,1,0):U$69)","v":338330.26},{"$f":"SUMIF(OFFSET($C17,1,0):$C$69,1,OFFSET(V17,1,0):V$69)","v":393336.05},{"$f":"SUMIF(OFFSET($C17,1,0):$C$69,1,OFFSET(W17,1,0):W$69)","v":551458.1},null,null,null,null,null,{"$f":"SUMIF(OFFSET($C17,1,0):$C$69,1,OFFSET(AC17,1,0):AC$69)","v":0}]
[null,null,null,null,null,null,null,null,null,null,null,{"$f":"INDEX(PO!K$12:K$145,MATCH($A20,PO!$V$12:$V$145,0))","v":"1."},{"$f":"INDEX(PO!N$12:N$145,MATCH($A20,PO!$V$12:$V$145,0))","v":"LOTE 1 - 1ª ETAPA DA REFORMA"},{"$f":"IF(ROUND(K20,2)=0,K20,ROUND(K20,2))","v":240414.59},"Parcela (%)",1,{"$f":"IF($B20,0,Q19-IF(ISNUMBER(P19),P19,0))","v":0.24984719105441983},0.27732231226066595,0,0,0,0,0,"",null,null,null,null,{"$f":"IF($B20,0,AC19-IF(ISNUMBER(AB19),AB19,0))","v":0}]
[null,null,null,null,null,null,null,null,null,null,null,null,null,null,"Acumulado (%)",{"$f":"MIN(IF($B20,P18+IF(ISNUMBER(O19),O19,0),P20/$N18),1)","v":0.47283049668491423},0.72267768773933405,1,1,1,1,1,1,null,null,null,null,null,{"$f":"MIN(IF($B20,AC18+IF(ISNUMBER(AB19),AB19,0),AC20/$N18),1)","v":0}]
[{"$f":"OFFSET(A20,-CFF.NumLinha,0)+1","v":1},{"$f":"$C20>=OFFSET($C20,CFF.NumLinha,0)","v":false},{"$f":"INDEX(PO!A$12:A$145,MATCH($A20,PO!$V$12:$V$145,0))","v":1},{"$f":"IF(ISERROR(J20),I20,SMALL(I20:J20,1))-1","v":26},{"$f":"IF($C20=1,OFFSET(E20,-CFF.NumLinha,0)+1,OFFSET(E20,-CFF.NumLinha,0))","v":1},{"$f":"IF($C20=1,0,IF($C20=2,OFFSET(F20,-CFF.NumLinha,0)+1,OFFSET(F20,-CFF.NumLinha,0)))","v":0},{"$f":"IF(AND($C20<=2,$C20<>0),0,IF($C20=3,OFFSET(G20,-CFF.NumLinha,0)+1,OFFSET(G20,-CFF.NumLinha,0)))","v":0},{"$f":"IF(AND($C20<=3,$C20<>0),0,IF($C20=4,OFFSET(H20,-CFF.NumLinha,0)+1,OFFSET(H20,-CFF.NumLinha,0)))","v":0},{"$f":"MATCH(0,OFFSET($D20,1,$C20,ROW($A$69)-ROW($A20)),0)","v":49},{"$f":"MATCH(OFFSET($D20,0,$C20)+1,OFFSET($D20,1,$C20,ROW($A$69)-ROW($A20)),0)","v":27},{"$f":"ROUND(INDEX(PO!T$12:T$145,MATCH($A20,PO!$V$12:$V$145,0)),2)+10^-12","v":240414.59},null,null,null,"Acumulado (R$)",{"$f":"IF($B20,ROUND(P19*$N18,2),ROUND(SUMIF(OFFSET($B20,1,0,$D20),TRUE,OFFSET(P20,1,0,$D20))/SUMIF(OFFSET($B20,1,0,$D20),TRUE,OFFSET($K20,1,0,$D20))*$N18,2))","v":113675.35},173742.26,240414.59,240414.59,240414.59,240414.59,240414.59,240414.59,null,null,null,null,null,{"$f":"IF($B20,ROUND(AC19*$N18,2),ROUND(SUMIF(OFFSET($B20,1,0,$D20),TRUE,OFFSET(AC20,1,0,$D20))/SUMIF(OFFSET($B20,1,0,$D20),TRUE,OFFSET($K20,1,0,$D20))*$N18,2))","v":0}]
[null,null,null,null,null,null,null,null,null,null,null,{"$f":"INDEX(PO!K$12:K$145,MATCH($A23,PO!$V$12:$V$145,0))","v":"1.1."},{"$f":"INDEX(PO!N$12:N$145,MATCH($A23,PO!$V$12:$V$145,0))","v":"SERVIÇOS INICIAIS"},{"$f":"IF(ROUND(K23,2)=0,K23,ROUND(K23,2))","v":8429.14},"Parcela (%)",0.2,0.4,0.4,{"$f":"IF($B23,0,S22-IF(ISNUMBER(R22),R22,0))","v":0},{"$f":"IF($B23,0,T22-IF(ISNUMBER(S22),S22,0))","v":0},{"$f":"IF($B23,0,U22-IF(ISNUMBER(T22),T22,0))","v":0},{"$f":"IF($B23,0,V22-IF(ISNUMBER(U22),U22,0))","v":0},{"$f":"IF($B23,0,W22-IF(ISNUMBER(V22),V22,0))","v":0},null,null,null,null,null,{"$f":"IF($B23,0,AC22-IF(ISNUMBER(AB22),AB22,0))","v":0}]
[null,null,null,null,null,null,null,null,null,null,null,null,null,null,"Acumulado (%)",{"$f":"MIN(IF($B23,P21+IF(ISNUMBER(O22),O22,0),P23/$N21),1)","v":0.2},{"$f":"MIN(IF($B23,Q21+IF(ISNUMBER(P22),P22,0),Q23/$N21),1)","v":0.60000000000000009},{"$f":"MIN(IF($B23,R21+IF(ISNUMBER(Q22),Q22,0),R23/$N21),1)","v":1},{"$f":"MIN(IF($B23,S21+IF(ISNUMBER(R22),R22,0),S23/$N21),1)","v":1},{"$f":"MIN(IF($B23,T21+IF(ISNUMBER(S22),S22,0),T23/$N21),1)","v":1},{"$f":"MIN(IF($B23,U21+IF(ISNUMBER(T22),T22,0),U23/$N21),1)","v":1},{"$f":"MIN(IF($B23,V21+IF(ISNUMBER(U22),U22,0),V23/$N21),1)","v":1},{"$f":"MIN(IF($B23,W21+IF(ISNUMBER(V22),V22,0),W23/$N21),1)","v":1},null,null,null,null,null,{"$f":"MIN(IF($B23,AC21+IF(ISNUMBER(AB22),AB22,0),AC23/$N21),1)","v":0}]
[{"$f":"OFFSET(A23,-CFF.NumLinha,0)+1","v":2},{"$f":"$C23>=OFFSET($C23,CFF.NumLinha,0)","v":true},{"$f":"INDEX(PO!A$12:A$145,MATCH($A23,PO!$V$12:$V$145,0))","v":2},{"$f":"IF(ISERROR(J23),I23,SMALL(I23:J23,1))-1","v":2},{"$f":"IF($C23=1,OFFSET(E23,-CFF.NumLinha,0)+1,OFFSET(E23,-CFF.NumLinha,0))","v":1},{"$f":"IF($C23=1,0,IF($C23=2,OFFSET(F23,-CFF.NumLinha,0)+1,OFFSET(F23,-CFF.NumLinha,0)))","v":1},{"$f":"IF(AND($C23<=2,$C23<>0),0,IF($C23=3,OFFSET(G23,-CFF.NumLinha,0)+1,OFFSET(G23,-CFF.NumLinha,0)))","v":0},{"$f":"IF(AND($C23<=3,$C23<>0),0,IF($C23=4,OFFSET(H23,-CFF.NumLinha,0)+1,OFFSET(H23,-CFF.NumLinha,0)))","v":0},{"$f":"MATCH(0,OFFSET($D23,1,$C23,ROW($A$69)-ROW($A23)),0)","v":24},{"$f":"MATCH(OFFSET($D23,0,$C23)+1,OFFSET($D23,1,$C23,ROW($A$69)-ROW($A23)),0)","v":3},{"$f":"ROUND(INDEX(PO!T$12:T$145,MATCH($A23,PO!$V$12:$V$145,0)),2)+10^-12","v":8429.1400000000012},null,null,null,"Acumulado (R$)",{"$f":"IF($B23,ROUND(P22*$N21,2),ROUND(SUMIF(OFFSET($B23,1,0,$D23),TRUE,OFFSET(P23,1,0,$D23))/SUMIF(OFFSET($B23,1,0,$D23),TRUE,OFFSET($K23,1,0,$D23))*$N21,2))","v":1685.83},5057.4799999999996,8429.14,8429.14,8429.14,8429.14,8429.14,8429.14,null,null,null,null,null,{"$f":"IF($B23,ROUND(AC22*$N21,2),ROUND(SUMIF(OFFSET($B23,1,0,$D23),TRUE,OFFSET(AC23,1,0,$D23))/SUMIF(OFFSET($B23,1,0,$D23),TRUE,OFFSET($K23,1,0,$D23))*$N21,2))","v":0}]
[null,null,null,null,null,null,null,null,null,null,null,{"$f":"INDEX(PO!K$12:K$145,MATCH($A26,PO!$V$12:$V$145,0))","v":"1.2."},{"$f":"INDEX(PO!N$12:N$145,MATCH($A26,PO!$V$12:$V$145,0))","v":"COBERTURA E PLATATIBANDA"},{"$f":"IF(ROUND(K26,2)=0,K26,ROUND(K26,2))","v":111989.52},"Parcela (%)",1,1,{"$f":"IF($B26,0,R25-IF(ISNUMBER(Q25),Q25,0))","v":0},{"$f":"IF($B26,0,S25-IF(ISNUMBER(R25),R25,0))","v":0},{"$f":"IF($B26,0,T25-IF(ISNUMBER(S25),S25,0))","v":0},{"$f":"IF($B26,0,U25-IF(ISNUMBER(T25),T25,0))","v":0},{"$f":"IF($B26,0,V25-IF(ISNUMBER(U25),U25,0))","v":0},{"$f":"IF($B26,0,W25-IF(ISNUMBER(V25),V25,0))","v":0},null,null,null,null,null,{"$f":"IF($B26,0,AC25-IF(ISNUMBER(AB25),AB25,0))","v":0}]
[null,null,null,null,null,null,null,null,null,null,null,null,null,null,"Acumulado (%)",{"$f":"MIN(IF($B26,P24+IF(ISNUMBER(O25),O25,0),P26/$N24),1)","v":1},{"$f":"MIN(IF($B26,Q24+IF(ISNUMBER(P25),P25,0),Q26/$N24),1)","v":1},{"$f":"MIN(IF($B26,R24+IF(ISNUMBER(Q25),Q25,0),R26/$N24),1)","v":1},{"$f":"MIN(IF($B26,S24+IF(ISNUMBER(R25),R25,0),S26/$N24),1)","v":1},{"$f":"MIN(IF($B26,T24+IF(ISNUMBER(S25),S25,0),T26/$N24),1)","v":1},{"$f":"MIN(IF($B26,U24+IF(ISNUMBER(T25),T25,0),U26/$N24),1)","v":1},{"$f":"MIN(IF($B26,V24+IF(ISNUMBER(U25),U25,0),V26/$N24),1)","v":1},{"$f":"MIN(IF($B26,W24+IF(ISNUMBER(V25),V25,0),W26/$N24),1)","v":1},null,null,null,null,null,{"$f":"MIN(IF($B26,AC24+IF(ISNUMBER(AB25),AB25,0),AC26/$N24),1)","v":0}]
[{"$f":"OFFSET(A26,-CFF.NumLinha,0)+1","v":3},{"$f":"$C26>=OFFSET($C26,CFF.NumLinha,0)","v":true},{"$f":"INDEX(PO!A$12:A$145,MATCH($A26,PO!$V$12:$V$145,0))","v":2},{"$f":"IF(ISERROR(J26),I26,SMALL(I26:J26,1))-1","v":2},{"$f":"IF($C26=1,OFFSET(E26,-CFF.NumLinha,0)+1,OFFSET(E26,-CFF.NumLinha,0))","v":1},{"$f":"IF($C26=1,0,IF($C26=2,OFFSET(F26,-CFF.NumLinha,0)+1,OFFSET(F26,-CFF.NumLinha,0)))","v":2},{"$f":"IF(AND($C26<=2,$C26<>0),0,IF($C26=3,OFFSET(G26,-CFF.NumLinha,0)+1,OFFSET(G26,-CFF.NumLinha,0)))","v":0},{"$f":"IF(AND($C26<=3,$C26<>0),0,IF($C26=4,OFFSET(H26,-CFF.NumLinha,0)+1,OFFSET(H26,-CFF.NumLinha,0)))","v":0},{"$f":"MATCH(0,OFFSET($D26,1,$C26,ROW($A$69)-ROW($A26)),0)","v":21},{"$f":"MATCH(OFFSET($D26,0,$C26)+1,OFFSET($D26,1,$C26,ROW($A$69)-ROW($A26)),0)","v":3},{"$f":"ROUND(INDEX(PO!T$12:T$145,MATCH($A26,PO!$V$12:$V$145,0)),2)+10^-12","v":111989.52},null,null,null,"Acumulado (R$)",{"$f":"IF($B26,ROUND(P25*$N24,2),ROUND(SUMIF(OFFSET($B26,1,0,$D26),TRUE,OFFSET(P26,1,0,$D26))/SUMIF(OFFSET($B26,1,0,$D26),TRUE,OFFSET($K26,1,0,$D26))*$N24,2))","v":111989.52},111989.52,111989.52,111989.52,111989.52,111989.52,111989.52,111989.52,null,null,null,null,null,{"$f":"IF($B26,ROUND(AC25*$N24,2),ROUND(SUMIF(OFFSET($B26,1,0,$D26),TRUE,OFFSET(AC26,1,0,$D26))/SUMIF(OFFSET($B26,1,0,$D26),TRUE,OFFSET($K26,1,0,$D26))*$N24,2))","v":0}]
[null,null,null,null,null,null,null,null,null,null,null,{"$f":"INDEX(PO!K$12:K$145,MATCH($A29,PO!$V$12:$V$145,0))","v":"1.3."},{"$f":"INDEX(PO!N$12:N$145,MATCH($A29,PO!$V$12:$V$145,0))","v":"REMOÇÃO DOS REVESTIMENTOS"},{"$f":"IF(ROUND(K29,2)=0,K29,ROUND(K29,2))","v":5977.33},"Parcela (%)",0,0.5,0.5,{"$f":"IF($B29,0,S28-IF(ISNUMBER(R28),R28,0))","v":0},{"$f":"IF($B29,0,T28-IF(ISNUMBER(S28),S28,0))","v":0},{"$f":"IF($B29,0,U28-IF(ISNUMBER(T28),T28,0))","v":0},{"$f":"IF($B29,0,V28-IF(ISNUMBER(U28),U28,0))","v":0},{"$f":"IF($B29,0,W28-IF(ISNUMBER(V28),V28,0))","v":0},null,null,null,null,null,{"$f":"IF($B29,0,AC28-IF(ISNUMBER(AB28),AB28,0))","v":0}]
[null,null,null,null,null,null,null,null,null,null,null,null,null,null,"Acumulado (%)",{"$f":"MIN(IF($B29,P27+IF(ISNUMBER(O28),O28,0),P29/$N27),1)","v":0},{"$f":"MIN(IF($B29,Q27+IF(ISNUMBER(P28),P28,0),Q29/$N27),1)","v":0.5},{"$f":"MIN(IF($B29,R27+IF(ISNUMBER(Q28),Q28,0),R29/$N27),1)","v":1},{"$f":"MIN(IF($B29,S27+IF(ISNUMBER(R28),R28,0),S29/$N27),1)","v":1},{"$f":"MIN(IF($B29,T27+IF(ISNUMBER(S28),S28,0),T29/$N27),1)","v":1},{"$f":"MIN(IF($B29,U27+IF(ISNUMBER(T28),T28,0),U29/$N27),1)","v":1},{"$f":"MIN(IF($B29,V27+IF(ISNUMBER(U28),U28,0),V29/$N27),1)","v":1},{"$f":"MIN(IF($B29,W27+IF(ISNUMBER(V28),V28,0),W29/$N27),1)","v":1},null,null,null,null,null,{"$f":"MIN(IF($B29,AC27+IF(ISNUMBER(AB28),AB28,0),AC29/$N27),1)","v":0}]
[{"$f":"OFFSET(A29,-CFF.NumLinha,0)+1","v":4},{"$f":"$C29>=OFFSET($C29,CFF.NumLinha,0)","v":true},{"$f":"INDEX(PO!A$12:A$145,MATCH($A29,PO!$V$12:$V$145,0))","v":2},{"$f":"IF(ISERROR(J29),I29,SMALL(I29:J29,1))-1","v":2},{"$f":"IF($C29=1,OFFSET(E29,-CFF.NumLinha,0)+1,OFFSET(E29,-CFF.NumLinha,0))","v":1},{"$f":"IF($C29=1,0,IF($C29=2,OFFSET(F29,-CFF.NumLinha,0)+1,OFFSET(F29,-CFF.NumLinha,0)))","v":3},{"$f":"IF(AND($C29<=2,$C29<>0),0,IF($C29=3,OFFSET(G29,-CFF.NumLinha,0)+1,OFFSET(G29,-CFF.NumLinha,0)))","v":0},{"$f":"IF(AND($C29<=3,$C29<>0),0,IF($C29=4,OFFSET(H29,-CFF.NumLinha,0)+1,OFFSET(H29,-CFF.NumLinha,0)))","v":0},{"$f":"MATCH(0,OFFSET($D29,1,$C29,ROW($A$69)-ROW($A29)),0)","v":18},{"$f":"MATCH(OFFSET($D29,0,$C29)+1,OFFSET($D29,1,$C29,ROW($A$69)-ROW($A29)),0)","v":3},{"$f":"ROUND(INDEX(PO!T$12:T$145,MATCH($A29,PO!$V$12:$V$145,0)),2)+10^-12","v":5977.3300000000008},null,null,null,"Acumulado (R$)",{"$f":"IF($B29,ROUND(P28*$N27,2),ROUND(SUMIF(OFFSET($B29,1,0,$D29),TRUE,OFFSET(P29,1,0,$D29))/SUMIF(OFFSET($B29,1,0,$D29),TRUE,OFFSET($K29,1,0,$D29))*$N27,2))","v":0},2988.67,5977.33,5977.33,5977.33,5977.33,5977.33,5977.33,null,null,null,null,null,{"$f":"IF($B29,ROUND(AC28*$N27,2),ROUND(SUMIF(OFFSET($B29,1,0,$D29),TRUE,OFFSET(AC29,1,0,$D29))/SUMIF(OFFSET($B29,1,0,$D29),TRUE,OFFSET($K29,1,0,$D29))*$N27,2))","v":0}]
[null,null,null,null,null,null,null,null,null,null,null,{"$f":"INDEX(PO!K$12:K$145,MATCH($A32,PO!$V$12:$V$145,0))","v":"1.4."},{"$f":"INDEX(PO!N$12:N$145,MATCH($A32,PO!$V$12:$V$145,0))","v":"SACADA"},{"$f":"IF(ROUND(K32,2)=0,K32,ROUND(K32,2))","v":17329.759999999998},"Parcela (%)",0,0.25,0.75,{"$f":"IF($B32,0,S31-IF(ISNUMBER(R31),R31,0))","v":0},{"$f":"IF($B32,0,T31-IF(ISNUMBER(S31),S31,0))","v":0},{"$f":"IF($B32,0,U31-IF(ISNUMBER(T31),T31,0))","v":0},{"$f":"IF($B32,0,V31-IF(ISNUMBER(U31),U31,0))","v":0},{"$f":"IF($B32,0,W31-IF(ISNUMBER(V31),V31,0))","v":0},null,null,null,null,null,{"$f":"IF($B32,0,AC31-IF(ISNUMBER(AB31),AB31,0))","v":0}]
[null,null,null,null,null,null,null,null,null,null,null,null,null,null,"Acumulado (%)",{"$f":"MIN(IF($B32,P30+IF(ISNUMBER(O31),O31,0),P32/$N30),1)","v":0},{"$f":"MIN(IF($B32,Q30+IF(ISNUMBER(P31),P31,0),Q32/$N30),1)","v":0.25},{"$f":"MIN(IF($B32,R30+IF(ISNUMBER(Q31),Q31,0),R32/$N30),1)","v":1},{"$f":"MIN(IF($B32,S30+IF(ISNUMBER(R31),R31,0),S32/$N30),1)","v":1},{"$f":"MIN(IF($B32,T30+IF(ISNUMBER(S31),S31,0),T32/$N30),1)","v":1},{"$f":"MIN(IF($B32,U30+IF(ISNUMBER(T31),T31,0),U32/$N30),1)","v":1},{"$f":"MIN(IF($B32,V30+IF(ISNUMBER(U31),U31,0),V32/$N30),1)","v":1},{"$f":"MIN(IF($B32,W30+IF(ISNUMBER(V31),V31,0),W32/$N30),1)","v":1},null,null,null,null,null,{"$f":"MIN(IF($B32,AC30+IF(ISNUMBER(AB31),AB31,0),AC32/$N30),1)","v":0}]
[{"$f":"OFFSET(A32,-CFF.NumLinha,0)+1","v":5},{"$f":"$C32>=OFFSET($C32,CFF.NumLinha,0)","v":true},{"$f":"INDEX(PO!A$12:A$145,MATCH($A32,PO!$V$12:$V$145,0))","v":2},{"$f":"IF(ISERROR(J32),I32,SMALL(I32:J32,1))-1","v":2},{"$f":"IF($C32=1,OFFSET(E32,-CFF.NumLinha,0)+1,OFFSET(E32,-CFF.NumLinha,0))","v":1},{"$f":"IF($C32=1,0,IF($C32=2,OFFSET(F32,-CFF.NumLinha,0)+1,OFFSET(F32,-CFF.NumLinha,0)))","v":4},{"$f":"IF(AND($C32<=2,$C32<>0),0,IF($C32=3,OFFSET(G32,-CFF.NumLinha,0)+1,OFFSET(G32,-CFF.NumLinha,0)))","v":0},{"$f":"IF(AND($C32<=3,$C32<>0),0,IF($C32=4,OFFSET(H32,-CFF.NumLinha,0)+1,OFFSET(H32,-CFF.NumLinha,0)))","v":0},{"$f":"MATCH(0,OFFSET($D32,1,$C32,ROW($A$69)-ROW($A32)),0)","v":15},{"$f":"MATCH(OFFSET($D32,0,$C32)+1,OFFSET($D32,1,$C32,ROW($A$69)-ROW($A32)),0)","v":3},{"$f":"ROUND(INDEX(PO!T$12:T$145,MATCH($A32,PO!$V$12:$V$145,0)),2)+10^-12","v":17329.759999999998},null,null,null,"Acumulado (R$)",{"$f":"IF($B32,ROUND(P31*$N30,2),ROUND(SUMIF(OFFSET($B32,1,0,$D32),TRUE,OFFSET(P32,1,0,$D32))/SUMIF(OFFSET($B32,1,0,$D32),TRUE,OFFSET($K32,1,0,$D32))*$N30,2))","v":0},4332.4399999999996,17329.759999999998,17329.759999999998,17329.759999999998,17329.759999999998,17329.759999999998,17329.759999999998,null,null,null,null,null,{"$f":"IF($B32,ROUND(AC31*$N30,2),ROUND(SUMIF(OFFSET($B32,1,0,$D32),TRUE,OFFSET(AC32,1,0,$D32))/SUMIF(OFFSET($B32,1,0,$D32),TRUE,OFFSET($K32,1,0,$D32))*$N30,2))","v":0}]
[null,null,null,null,null,null,null,null,null,null,null,{"$f":"INDEX(PO!K$12:K$145,MATCH($A35,PO!$V$12:$V$145,0))","v":"1.5."},{"$f":"INDEX(PO!N$12:N$145,MATCH($A35,PO!$V$12:$V$145,0))","v":"TRATAMENTO DE TRINCAS E FISSURAS"},{"$f":"IF(ROUND(K35,2)=0,K35,ROUND(K35,2))","v":1115.7},"Parcela (%)",0,0.5,0.5,{"$f":"IF($B35,0,S34-IF(ISNUMBER(R34),R34,0))","v":0},{"$f":"IF($B35,0,T34-IF(ISNUMBER(S34),S34,0))","v":0},{"$f":"IF($B35,0,U34-IF(ISNUMBER(T34),T34,0))","v":0},{"$f":"IF($B35,0,V34-IF(ISNUMBER(U34),U34,0))","v":0},{"$f":"IF($B35,0,W34-IF(ISNUMBER(V34),V34,0))","v":0},null,null,null,null,null,{"$f":"IF($B35,0,AC34-IF(ISNUMBER(AB34),AB34,0))","v":0}]
[null,null,null,null,null,null,null,null,null,null,null,null,null,null,"Acumulado (%)",{"$f":"MIN(IF($B35,P33+IF(ISNUMBER(O34),O34,0),P35/$N33),1)","v":0},{"$f":"MIN(IF($B35,Q33+IF(ISNUMBER(P34),P34,0),Q35/$N33),1)","v":0.5},{"$f":"MIN(IF($B35,R33+IF(ISNUMBER(Q34),Q34,0),R35/$N33),1)","v":1},{"$f":"MIN(IF($B35,S33+IF(ISNUMBER(R34),R34,0),S35/$N33),1)","v":1},{"$f":"MIN(IF($B35,T33+IF(ISNUMBER(S34),S34,0),T35/$N33),1)","v":1},{"$f":"MIN(IF($B35,U33+IF(ISNUMBER(T34),T34,0),U35/$N33),1)","v":1},{"$f":"MIN(IF($B35,V33+IF(ISNUMBER(U34),U34,0),V35/$N33),1)","v":1},{"$f":"MIN(IF($B35,W33+IF(ISNUMBER(V34),V34,0),W35/$N33),1)","v":1},null,null,null,null,null,{"$f":"MIN(IF($B35,AC33+IF(ISNUMBER(AB34),AB34,0),AC35/$N33),1)","v":0}]
[{"$f":"OFFSET(A35,-CFF.NumLinha,0)+1","v":6},{"$f":"$C35>=OFFSET($C35,CFF.NumLinha,0)","v":true},{"$f":"INDEX(PO!A$12:A$145,MATCH($A35,PO!$V$12:$V$145,0))","v":2},{"$f":"IF(ISERROR(J35),I35,SMALL(I35:J35,1))-1","v":2},{"$f":"IF($C35=1,OFFSET(E35,-CFF.NumLinha,0)+1,OFFSET(E35,-CFF.NumLinha,0))","v":1},{"$f":"IF($C35=1,0,IF($C35=2,OFFSET(F35,-CFF.NumLinha,0)+1,OFFSET(F35,-CFF.NumLinha,0)))","v":5},{"$f":"IF(AND($C35<=2,$C35<>0),0,IF($C35=3,OFFSET(G35,-CFF.NumLinha,0)+1,OFFSET(G35,-CFF.NumLinha,0)))","v":0},{"$f":"IF(AND($C35<=3,$C35<>0),0,IF($C35=4,OFFSET(H35,-CFF.NumLinha,0)+1,OFFSET(H35,-CFF.NumLinha,0)))","v":0},{"$f":"MATCH(0,OFFSET($D35,1,$C35,ROW($A$69)-ROW($A35)),0)","v":12},{"$f":"MATCH(OFFSET($D35,0,$C35)+1,OFFSET($D35,1,$C35,ROW($A$69)-ROW($A35)),0)","v":3},{"$f":"ROUND(INDEX(PO!T$12:T$145,MATCH($A35,PO!$V$12:$V$145,0)),2)+10^-12","v":1115.700000000001},null,null,null,"Acumulado (R$)",{"$f":"IF($B35,ROUND(P34*$N33,2),ROUND(SUMIF(OFFSET($B35,1,0,$D35),TRUE,OFFSET(P35,1,0,$D35))/SUMIF(OFFSET($B35,1,0,$D35),TRUE,OFFSET($K35,1,0,$D35))*$N33,2))","v":0},557.85,1115.7,1115.7,1115.7,1115.7,1115.7,1115.7,null,null,null,null,null,{"$f":"IF($B35,ROUND(AC34*$N33,2),ROUND(SUMIF(OFFSET($B35,1,0,$D35),TRUE,OFFSET(AC35,1,0,$D35))/SUMIF(OFFSET($B35,1,0,$D35),TRUE,OFFSET($K35,1,0,$D35))*$N33,2))","v":0}]
[null,null,null,null,null,null,null,null,null,null,null,{"$f":"INDEX(PO!K$12:K$145,MATCH($A38,PO!$V$12:$V$145,0))","v":"1.6."},{"$f":"INDEX(PO!N$12:N$145,MATCH($A38,PO!$V$12:$V$145,0))","v":"ESQUADRIAS"},{"$f":"IF(ROUND(K38,2)=0,K38,ROUND(K38,2))","v":93147.89},"Parcela (%)",0,0.5,0.5,{"$f":"IF($B38,0,S37-IF(ISNUMBER(R37),R37,0))","v":0},{"$f":"IF($B38,0,T37-IF(ISNUMBER(S37),S37,0))","v":0},{"$f":"IF($B38,0,U37-IF(ISNUMBER(T37),T37,0))","v":0},{"$f":"IF($B38,0,V37-IF(ISNUMBER(U37),U37,0))","v":0},{"$f":"IF($B38,0,W37-IF(ISNUMBER(V37),V37,0))","v":0},null,null,null,null,null,{"$f":"IF($B38,0,AC37-IF(ISNUMBER(AB37),AB37,0))","v":0}]
[null,null,null,null,null,null,null,null,null,null,null,null,null,null,"Acumulado (%)",{"$f":"MIN(IF($B38,P36+IF(ISNUMBER(O37),O37,0),P38/$N36),1)","v":0},{"$f":"MIN(IF($B38,Q36+IF(ISNUMBER(P37),P37,0),Q38/$N36),1)","v":0.5},{"$f":"MIN(IF($B38,R36+IF(ISNUMBER(Q37),Q37,0),R38/$N36),1)","v":1},{"$f":"MIN(IF($B38,S36+IF(ISNUMBER(R37),R37,0),S38/$N36),1)","v":1},{"$f":"MIN(IF($B38,T36+IF(ISNUMBER(S37),S37,0),T38/$N36),1)","v":1},{"$f":"MIN(IF($B38,U36+IF(ISNUMBER(T37),T37,0),U38/$N36),1)","v":1},{"$f":"MIN(IF($B38,V36+IF(ISNUMBER(U37),U37,0),V38/$N36),1)","v":1},{"$f":"MIN(IF($B38,W36+IF(ISNUMBER(V37),V37,0),W38/$N36),1)","v":1},null,null,null,null,null,{"$f":"MIN(IF($B38,AC36+IF(ISNUMBER(AB37),AB37,0),AC38/$N36),1)","v":0}]
[{"$f":"OFFSET(A38,-CFF.NumLinha,0)+1","v":7},{"$f":"$C38>=OFFSET($C38,CFF.NumLinha,0)","v":true},{"$f":"INDEX(PO!A$12:A$145,MATCH($A38,PO!$V$12:$V$145,0))","v":2},{"$f":"IF(ISERROR(J38),I38,SMALL(I38:J38,1))-1","v":2},{"$f":"IF($C38=1,OFFSET(E38,-CFF.NumLinha,0)+1,OFFSET(E38,-CFF.NumLinha,0))","v":1},{"$f":"IF($C38=1,0,IF($C38=2,OFFSET(F38,-CFF.NumLinha,0)+1,OFFSET(F38,-CFF.NumLinha,0)))","v":6},{"$f":"IF(AND($C38<=2,$C38<>0),0,IF($C38=3,OFFSET(G38,-CFF.NumLinha,0)+1,OFFSET(G38,-CFF.NumLinha,0)))","v":0},{"$f":"IF(AND($C38<=3,$C38<>0),0,IF($C38=4,OFFSET(H38,-CFF.NumLinha,0)+1,OFFSET(H38,-CFF.NumLinha,0)))","v":0},{"$f":"MATCH(0,OFFSET($D38,1,$C38,ROW($A$69)-ROW($A38)),0)","v":9},{"$f":"MATCH(OFFSET($D38,0,$C38)+1,OFFSET($D38,1,$C38,ROW($A$69)-ROW($A38)),0)","v":3},{"$f":"ROUND(INDEX(PO!T$12:T$145,MATCH($A38,PO!$V$12:$V$145,0)),2)+10^-12","v":93147.89},null,null,null,"Acumulado (R$)",{"$f":"IF($B38,ROUND(P37*$N36,2),ROUND(SUMIF(OFFSET($B38,1,0,$D38),TRUE,OFFSET(P38,1,0,$D38))/SUMIF(OFFSET($B38,1,0,$D38),TRUE,OFFSET($K38,1,0,$D38))*$N36,2))","v":0},46573.95,93147.89,93147.89,93147.89,93147.89,93147.89,93147.89,null,null,null,null,null,{"$f":"IF($B38,ROUND(AC37*$N36,2),ROUND(SUMIF(OFFSET($B38,1,0,$D38),TRUE,OFFSET(AC38,1,0,$D38))/SUMIF(OFFSET($B38,1,0,$D38),TRUE,OFFSET($K38,1,0,$D38))*$N36,2))","v":0}]
[null,null,null,null,null,null,null,null,null,null,null,{"$f":"INDEX(PO!K$12:K$145,MATCH($A41,PO!$V$12:$V$145,0))","v":"1.7."},{"$f":"INDEX(PO!N$12:N$145,MATCH($A41,PO!$V$12:$V$145,0))","v":"CALÇADA EXTERNA DA FACHADA LESTE"},{"$f":"IF(ROUND(K41,2)=0,K41,ROUND(K41,2))","v":2222.0300000000002},"Parcela (%)",{"$f":"IF($B41,0,P40-IF(ISNUMBER(O40),O40,0))","v":0},1,{"$f":"IF($B41,0,R40-IF(ISNUMBER(Q40),Q40,0))","v":0},{"$f":"IF($B41,0,S40-IF(ISNUMBER(R40),R40,0))","v":0},{"$f":"IF($B41,0,T40-IF(ISNUMBER(S40),S40,0))","v":0},{"$f":"IF($B41,0,U40-IF(ISNUMBER(T40),T40,0))","v":0},{"$f":"IF($B41,0,V40-IF(ISNUMBER(U40),U40,0))","v":0},{"$f":"IF($B41,0,W40-IF(ISNUMBER(V40),V40,0))","v":0},null,null,null,null,null,{"$f":"IF($B41,0,AC40-IF(ISNUMBER(AB40),AB40,0))","v":0}]
[null,null,null,null,null,null,null,null,null,null,null,null,null,null,"Acumulado (%)",{"$f":"MIN(IF($B41,P39+IF(ISNUMBER(O40),O40,0),P41/$N39),1)","v":0},{"$f":"MIN(IF($B41,Q39+IF(ISNUMBER(P40),P40,0),Q41/$N39),1)","v":1},{"$f":"MIN(IF($B41,R39+IF(ISNUMBER(Q40),Q40,0),R41/$N39),1)","v":1},{"$f":"MIN(IF($B41,S39+IF(ISNUMBER(R40),R40,0),S41/$N39),1)","v":1},{"$f":"MIN(IF($B41,T39+IF(ISNUMBER(S40),S40,0),T41/$N39),1)","v":1},{"$f":"MIN(IF($B41,U39+IF(ISNUMBER(T40),T40,0),U41/$N39),1)","v":1},{"$f":"MIN(IF($B41,V39+IF(ISNUMBER(U40),U40,0),V41/$N39),1)","v":1},{"$f":"MIN(IF($B41,W39+IF(ISNUMBER(V40),V40,0),W41/$N39),1)","v":1},null,null,null,null,null,{"$f":"MIN(IF($B41,AC39+IF(ISNUMBER(AB40),AB40,0),AC41/$N39),1)","v":0}]
[{"$f":"OFFSET(A41,-CFF.NumLinha,0)+1","v":8},{"$f":"$C41>=OFFSET($C41,CFF.NumLinha,0)","v":true},{"$f":"INDEX(PO!A$12:A$145,MATCH($A41,PO!$V$12:$V$145,0))","v":2},{"$f":"IF(ISERROR(J41),I41,SMALL(I41:J41,1))-1","v":2},{"$f":"IF($C41=1,OFFSET(E41,-CFF.NumLinha,0)+1,OFFSET(E41,-CFF.NumLinha,0))","v":1},{"$f":"IF($C41=1,0,IF($C41=2,OFFSET(F41,-CFF.NumLinha,0)+1,OFFSET(F41,-CFF.NumLinha,0)))","v":7},{"$f":"IF(AND($C41<=2,$C41<>0),0,IF($C41=3,OFFSET(G41,-CFF.NumLinha,0)+1,OFFSET(G41,-CFF.NumLinha,0)))","v":0},{"$f":"IF(AND($C41<=3,$C41<>0),0,IF($C41=4,OFFSET(H41,-CFF.NumLinha,0)+1,OFFSET(H41,-CFF.NumLinha,0)))","v":0},{"$f":"MATCH(0,OFFSET($D41,1,$C41,ROW($A$69)-ROW($A41)),0)","v":6},{"$f":"MATCH(OFFSET($D41,0,$C41)+1,OFFSET($D41,1,$C41,ROW($A$69)-ROW($A41)),0)","v":3},{"$f":"ROUND(INDEX(PO!T$12:T$145,MATCH($A41,PO!$V$12:$V$145,0)),2)+10^-12","v":2222.0300000000011},null,null,null,"Acumulado (R$)",{"$f":"IF($B41,ROUND(P40*$N39,2),ROUND(SUMIF(OFFSET($B41,1,0,$D41),TRUE,OFFSET(P41,1,0,$D41))/SUMIF(OFFSET($B41,1,0,$D41),TRUE,OFFSET($K41,1,0,$D41))*$N39,2))","v":0},2222.0300000000002,2222.0300000000002,2222.0300000000002,2222.0300000000002,2222.0300000000002,2222.0300000000002,2222.0300000000002,null,null,null,null,null,{"$f":"IF($B41,ROUND(AC40*$N39,2),ROUND(SUMIF(OFFSET($B41,1,0,$D41),TRUE,OFFSET(AC41,1,0,$D41))/SUMIF(OFFSET($B41,1,0,$D41),TRUE,OFFSET($K41,1,0,$D41))*$N39,2))","v":0}]
[null,null,null,null,null,null,null,null,null,null,null,{"$f":"INDEX(PO!K$12:K$145,MATCH($A44,PO!$V$12:$V$145,0))","v":"1.8."},{"$f":"INDEX(PO!N$12:N$145,MATCH($A44,PO!$V$12:$V$145,0))","v":"SERVIÇOS FINAIS"},{"$f":"IF(ROUND(K44,2)=0,K44,ROUND(K44,2))","v":203.22},"Parcela (%)",{"$f":"IF($B44,0,P43-IF(ISNUMBER(O43),O43,0))","v":0},0.1,0.9,{"$f":"IF($B44,0,S43-IF(ISNUMBER(R43),R43,0))","v":0},{"$f":"IF($B44,0,T43-IF(ISNUMBER(S43),S43,0))","v":0},{"$f":"IF($B44,0,U43-IF(ISNUMBER(T43),T43,0))","v":0},{"$f":"IF($B44,0,V43-IF(ISNUMBER(U43),U43,0))","v":0},{"$f":"IF($B44,0,W43-IF(ISNUMBER(V43),V43,0))","v":0},null,null,null,null,null,{"$f":"IF($B44,0,AC43-IF(ISNUMBER(AB43),AB43,0))","v":0}]
[null,null,null,null,null,null,null,null,null,null,null,null,null,null,"Acumulado (%)",{"$f":"MIN(IF($B44,P42+IF(ISNUMBER(O43),O43,0),P44/$N42),1)","v":0},{"$f":"MIN(IF($B44,Q42+IF(ISNUMBER(P43),P43,0),Q44/$N42),1)","v":0.1},{"$f":"MIN(IF($B44,R42+IF(ISNUMBER(Q43),Q43,0),R44/$N42),1)","v":1},{"$f":"MIN(IF($B44,S42+IF(ISNUMBER(R43),R43,0),S44/$N42),1)","v":1},{"$f":"MIN(IF($B44,T42+IF(ISNUMBER(S43),S43,0),T44/$N42),1)","v":1},{"$f":"MIN(IF($B44,U42+IF(ISNUMBER(T43),T43,0),U44/$N42),1)","v":1},{"$f":"MIN(IF($B44,V42+IF(ISNUMBER(U43),U43,0),V44/$N42),1)","v":1},{"$f":"MIN(IF($B44,W42+IF(ISNUMBER(V43),V43,0),W44/$N42),1)","v":1},null,null,null,null,null,{"$f":"MIN(IF($B44,AC42+IF(ISNUMBER(AB43),AB43,0),AC44/$N42),1)","v":0}]
[{"$f":"OFFSET(A44,-CFF.NumLinha,0)+1","v":9},{"$f":"$C44>=OFFSET($C44,CFF.NumLinha,0)","v":true},{"$f":"INDEX(PO!A$12:A$145,MATCH($A44,PO!$V$12:$V$145,0))","v":2},{"$f":"IF(ISERROR(J44),I44,SMALL(I44:J44,1))-1","v":2},{"$f":"IF($C44=1,OFFSET(E44,-CFF.NumLinha,0)+1,OFFSET(E44,-CFF.NumLinha,0))","v":1},{"$f":"IF($C44=1,0,IF($C44=2,OFFSET(F44,-CFF.NumLinha,0)+1,OFFSET(F44,-CFF.NumLinha,0)))","v":8},{"$f":"IF(AND($C44<=2,$C44<>0),0,IF($C44=3,OFFSET(G44,-CFF.NumLinha,0)+1,OFFSET(G44,-CFF.NumLinha,0)))","v":0},{"$f":"IF(AND($C44<=3,$C44<>0),0,IF($C44=4,OFFSET(H44,-CFF.NumLinha,0)+1,OFFSET(H44,-CFF.NumLinha,0)))","v":0},{"$f":"MATCH(0,OFFSET($D44,1,$C44,ROW($A$69)-ROW($A44)),0)","v":3},{"$f":"MATCH(OFFSET($D44,0,$C44)+1,OFFSET($D44,1,$C44,ROW($A$69)-ROW($A44)),0)","v":{"$error":"#N/A"}},{"$f":"ROUND(INDEX(PO!T$12:T$145,MATCH($A44,PO!$V$12:$V$145,0)),2)+10^-12","v":203.22000000000099},null,null,null,"Acumulado (R$)",{"$f":"IF($B44,ROUND(P43*$N42,2),ROUND(SUMIF(OFFSET($B44,1,0,$D44),TRUE,OFFSET(P44,1,0,$D44))/SUMIF(OFFSET($B44,1,0,$D44),TRUE,OFFSET($K44,1,0,$D44))*$N42,2))","v":0},20.32,203.22,203.22,203.22,203.22,203.22,203.22,null,null,null,null,null,{"$f":"IF($B44,ROUND(AC43*$N42,2),ROUND(SUMIF(OFFSET($B44,1,0,$D44),TRUE,OFFSET(AC44,1,0,$D44))/SUMIF(OFFSET($B44,1,0,$D44),TRUE,OFFSET($K44,1,0,$D44))*$N42,2))","v":0}]
[null,null,null,null,null,null,null,null,null,null,null,{"$f":"INDEX(PO!K$12:K$145,MATCH($A47,PO!$V$12:$V$145,0))","v":"2."},{"$f":"INDEX(PO!N$12:N$145,MATCH($A47,PO!$V$12:$V$145,0))","v":"LOTE 1 - 2ª ETAPA DA REFORMA"},{"$f":"IF(ROUND(K47,2)=0,K47,ROUND(K47,2))","v":207612.74},"Parcela (%)",{"$f":"IF($B47,0,P46-IF(ISNUMBER(O46),O46,0))","v":5.384544320353366E-3},1,{"$f":"IF($B47,0,R46-IF(ISNUMBER(Q46),Q46,0))","v":5.2271599517447739E-2},{"$f":"IF($B47,0,S46-IF(ISNUMBER(R46),R46,0))","v":0},{"$f":"IF($B47,0,T46-IF(ISNUMBER(S46),S46,0))","v":0},{"$f":"IF($B47,0,U46-IF(ISNUMBER(T46),T46,0))","v":0.24466619919374891},{"$f":"IF($B47,0,V46-IF(ISNUMBER(U46),U46,0))","v":0.26494419369447175},{"$f":"IF($B47,0,W46-IF(ISNUMBER(V46),V46,0))","v":0.41288655985177014},null,null,null,null,null,{"$f":"IF($B47,0,AC46-IF(ISNUMBER(AB46),AB46,0))","v":0}]
[null,null,null,null,null,null,null,null,null,null,null,null,null,null,"Acumulado (%)",{"$f":"MIN(IF($B47,P45+IF(ISNUMBER(O46),O46,0),P47/$N45),1)","v":5.384544320353366E-3},{"$f":"MIN(IF($B47,Q45+IF(ISNUMBER(P46),P46,0),Q47/$N45),1)","v":2.5231447742561464E-2},{"$f":"MIN(IF($B47,R45+IF(ISNUMBER(Q46),Q46,0),R47/$N45),1)","v":7.75030472600092E-2},{"$f":"MIN(IF($B47,S45+IF(ISNUMBER(R46),R46,0),S47/$N45),1)","v":7.75030472600092E-2},{"$f":"MIN(IF($B47,T45+IF(ISNUMBER(S46),S46,0),T47/$N45),1)","v":7.75030472600092E-2},{"$f":"MIN(IF($B47,U45+IF(ISNUMBER(T46),T46,0),U47/$N45),1)","v":0.32216924645375811},{"$f":"MIN(IF($B47,V45+IF(ISNUMBER(U46),U46,0),V47/$N45),1)","v":0.58711344014822986},{"$f":"MIN(IF($B47,W45+IF(ISNUMBER(V46),V46,0),W47/$N45),1)","v":1},null,null,null,null,null,{"$f":"MIN(IF($B47,AC45+IF(ISNUMBER(AB46),AB46,0),AC47/$N45),1)","v":0}]
[{"$f":"OFFSET(A47,-CFF.NumLinha,0)+1","v":10},{"$f":"$C47>=OFFSET($C47,CFF.NumLinha,0)","v":false},{"$f":"INDEX(PO!A$12:A$145,MATCH($A47,PO!$V$12:$V$145,0))","v":1},{"$f":"IF(ISERROR(J47),I47,SMALL(I47:J47,1))-1","v":20},{"$f":"IF($C47=1,OFFSET(E47,-CFF.NumLinha,0)+1,OFFSET(E47,-CFF.NumLinha,0))","v":2},{"$f":"IF($C47=1,0,IF($C47=2,OFFSET(F47,-CFF.NumLinha,0)+1,OFFSET(F47,-CFF.NumLinha,0)))","v":0},{"$f":"IF(AND($C47<=2,$C47<>0),0,IF($C47=3,OFFSET(G47,-CFF.NumLinha,0)+1,OFFSET(G47,-CFF.NumLinha,0)))","v":0},{"$f":"IF(AND($C47<=3,$C47<>0),0,IF($C47=4,OFFSET(H47,-CFF.NumLinha,0)+1,OFFSET(H47,-CFF.NumLinha,0)))","v":0},{"$f":"MATCH(0,OFFSET($D47,1,$C47,ROW($A$69)-ROW($A47)),0)","v":22},{"$f":"MATCH(OFFSET($D47,0,$C47)+1,OFFSET($D47,1,$C47,ROW($A$69)-ROW($A47)),0)","v":21},{"$f":"ROUND(INDEX(PO!T$12:T$145,MATCH($A47,PO!$V$12:$V$145,0)),2)+10^-12","v":207612.74},null,null,null,"Acumulado (R$)",{"$f":"IF($B47,ROUND(P46*$N45,2),ROUND(SUMIF(OFFSET($B47,1,0,$D47),TRUE,OFFSET(P47,1,0,$D47))/SUMIF(OFFSET($B47,1,0,$D47),TRUE,OFFSET($K47,1,0,$D47))*$N45,2))","v":1117.9000000000001},5238.37,16090.62,16090.62,16090.62,66886.44,121892.23,207612.74,null,null,null,null,null,{"$f":"IF($B47,ROUND(AC46*$N45,2),ROUND(SUMIF(OFFSET($B47,1,0,$D47),TRUE,OFFSET(AC47,1,0,$D47))/SUMIF(OFFSET($B47,1,0,$D47),TRUE,OFFSET($K47,1,0,$D47))*$N45,2))","v":0}]
[null,null,null,null,null,null,null,null,null,null,null,{"$f":"INDEX(PO!K$12:K$145,MATCH($A50,PO!$V$12:$V$145,0))","v":"2.1."},{"$f":"INDEX(PO!N$12:N$145,MATCH($A50,PO!$V$12:$V$145,0))","v":"SERVIÇOS INICIAIS"},{"$f":"IF(ROUND(K50,2)=0,K50,ROUND(K50,2))","v":6761.2},"Parcela (%)",0,0,0,{"$f":"IF($B50,0,S49-IF(ISNUMBER(R49),R49,0))","v":0},0,0.33,0.33,0.34,null,null,null,null,null,{"$f":"IF($B50,0,AC49-IF(ISNUMBER(AB49),AB49,0))","v":0}]
[null,null,null,null,null,null,null,null,null,null,null,null,null,null,"Acumulado (%)",{"$f":"MIN(IF($B50,P48+IF(ISNUMBER(O49),O49,0),P50/$N48),1)","v":0},{"$f":"MIN(IF($B50,Q48+IF(ISNUMBER(P49),P49,0),Q50/$N48),1)","v":0},{"$f":"MIN(IF($B50,R48+IF(ISNUMBER(Q49),Q49,0),R50/$N48),1)","v":0},{"$f":"MIN(IF($B50,S48+IF(ISNUMBER(R49),R49,0),S50/$N48),1)","v":0},{"$f":"MIN(IF($B50,T48+IF(ISNUMBER(S49),S49,0),T50/$N48),1)","v":0},{"$f":"MIN(IF($B50,U48+IF(ISNUMBER(T49),T49,0),U50/$N48),1)","v":0.33},{"$f":"MIN(IF($B50,V48+IF(ISNUMBER(U49),U49,0),V50/$N48),1)","v":0.66},{"$f":"MIN(IF($B50,W48+IF(ISNUMBER(V49),V49,0),W50/$N48),1)","v":1},null,null,null,null,null,{"$f":"MIN(IF($B50,AC48+IF(ISNUMBER(AB49),AB49,0),AC50/$N48),1)","v":0}]
[{"$f":"OFFSET(A50,-CFF.NumLinha,0)+1","v":11},{"$f":"$C50>=OFFSET($C50,CFF.NumLinha,0)","v":true},{"$f":"INDEX(PO!A$12:A$145,MATCH($A50,PO!$V$12:$V$145,0))","v":2},{"$f":"IF(ISERROR(J50),I50,SMALL(I50:J50,1))-1","v":2},{"$f":"IF($C50=1,OFFSET(E50,-CFF.NumLinha,0)+1,OFFSET(E50,-CFF.NumLinha,0))","v":2},{"$f":"IF($C50=1,0,IF($C50=2,OFFSET(F50,-CFF.NumLinha,0)+1,OFFSET(F50,-CFF.NumLinha,0)))","v":1},{"$f":"IF(AND($C50<=2,$C50<>0),0,IF($C50=3,OFFSET(G50,-CFF.NumLinha,0)+1,OFFSET(G50,-CFF.NumLinha,0)))","v":0},{"$f":"IF(AND($C50<=3,$C50<>0),0,IF($C50=4,OFFSET(H50,-CFF.NumLinha,0)+1,OFFSET(H50,-CFF.NumLinha,0)))","v":0},{"$f":"MATCH(0,OFFSET($D50,1,$C50,ROW($A$69)-ROW($A50)),0)","v":18},{"$f":"MATCH(OFFSET($D50,0,$C50)+1,OFFSET($D50,1,$C50,ROW($A$69)-ROW($A50)),0)","v":3},{"$f":"ROUND(INDEX(PO!T$12:T$145,MATCH($A50,PO!$V$12:$V$145,0)),2)+10^-12","v":6761.2000000000007},null,null,null,"Acumulado (R$)",{"$f":"IF($B50,ROUND(P49*$N48,2),ROUND(SUMIF(OFFSET($B50,1,0,$D50),TRUE,OFFSET(P50,1,0,$D50))/SUMIF(OFFSET($B50,1,0,$D50),TRUE,OFFSET($K50,1,0,$D50))*$N48,2))","v":0},0,0,0,0,2231.1999999999998,4462.3900000000003,6761.2,null,null,null,null,null,{"$f":"IF($B50,ROUND(AC49*$N48,2),ROUND(SUMIF(OFFSET($B50,1,0,$D50),TRUE,OFFSET(AC50,1,0,$D50))/SUMIF(OFFSET($B50,1,0,$D50),TRUE,OFFSET($K50,1,0,$D50))*$N48,2))","v":0}]
[null,null,null,null,null,null,null,null,null,null,null,{"$f":"INDEX(PO!K$12:K$145,MATCH($A53,PO!$V$12:$V$145,0))","v":"2.2."},{"$f":"INDEX(PO!N$12:N$145,MATCH($A53,PO!$V$12:$V$145,0))","v":"ESCADA"},{"$f":"IF(ROUND(K53,2)=0,K53,ROUND(K53,2))","v":16481.86},"Parcela (%)",0,0.25,0.25,0,0,0,0.5,{"$f":"IF($B53,0,W52-IF(ISNUMBER(V52),V52,0))","v":0},null,null,null,null,null,{"$f":"IF($B53,0,AC52-IF(ISNUMBER(AB52),AB52,0))","v":0}]
[null,null,null,null,null,null,null,null,null,null,null,null,null,null,"Acumulado (%)",{"$f":"MIN(IF($B53,P51+IF(ISNUMBER(O52),O52,0),P53/$N51),1)","v":0},{"$f":"MIN(IF($B53,Q51+IF(ISNUMBER(P52),P52,0),Q53/$N51),1)","v":0.25},{"$f":"MIN(IF($B53,R51+IF(ISNUMBER(Q52),Q52,0),R53/$N51),1)","v":0.5},{"$f":"MIN(IF($B53,S51+IF(ISNUMBER(R52),R52,0),S53/$N51),1)","v":0.5},{"$f":"MIN(IF($B53,T51+IF(ISNUMBER(S52),S52,0),T53/$N51),1)","v":0.5},{"$f":"MIN(IF($B53,U51+IF(ISNUMBER(T52),T52,0),U53/$N51),1)","v":0.5},{"$f":"MIN(IF($B53,V51+IF(ISNUMBER(U52),U52,0),V53/$N51),1)","v":1},{"$f":"MIN(IF($B53,W51+IF(ISNUMBER(V52),V52,0),W53/$N51),1)","v":1},null,null,null,null,null,{"$f":"MIN(IF($B53,AC51+IF(ISNUMBER(AB52),AB52,0),AC53/$N51),1)","v":0}]
[{"$f":"OFFSET(A53,-CFF.NumLinha,0)+1","v":12},{"$f":"$C53>=OFFSET($C53,CFF.NumLinha,0)","v":true},{"$f":"INDEX(PO!A$12:A$145,MATCH($A53,PO!$V$12:$V$145,0))","v":2},{"$f":"IF(ISERROR(J53),I53,SMALL(I53:J53,1))-1","v":2},{"$f":"IF($C53=1,OFFSET(E53,-CFF.NumLinha,0)+1,OFFSET(E53,-CFF.NumLinha,0))","v":2},{"$f":"IF($C53=1,0,IF($C53=2,OFFSET(F53,-CFF.NumLinha,0)+1,OFFSET(F53,-CFF.NumLinha,0)))","v":2},{"$f":"IF(AND($C53<=2,$C53<>0),0,IF($C53=3,OFFSET(G53,-CFF.NumLinha,0)+1,OFFSET(G53,-CFF.NumLinha,0)))","v":0},{"$f":"IF(AND($C53<=3,$C53<>0),0,IF($C53=4,OFFSET(H53,-CFF.NumLinha,0)+1,OFFSET(H53,-CFF.NumLinha,0)))","v":0},{"$f":"MATCH(0,OFFSET($D53,1,$C53,ROW($A$69)-ROW($A53)),0)","v":15},{"$f":"MATCH(OFFSET($D53,0,$C53)+1,OFFSET($D53,1,$C53,ROW($A$69)-ROW($A53)),0)","v":3},{"$f":"ROUND(INDEX(PO!T$12:T$145,MATCH($A53,PO!$V$12:$V$145,0)),2)+10^-12","v":16481.86},null,null,null,"Acumulado (R$)",{"$f":"IF($B53,ROUND(P52*$N51,2),ROUND(SUMIF(OFFSET($B53,1,0,$D53),TRUE,OFFSET(P53,1,0,$D53))/SUMIF(OFFSET($B53,1,0,$D53),TRUE,OFFSET($K53,1,0,$D53))*$N51,2))","v":0},4120.47,8240.93,8240.93,8240.93,8240.93,16481.86,16481.86,null,null,null,null,null,{"$f":"IF($B53,ROUND(AC52*$N51,2),ROUND(SUMIF(OFFSET($B53,1,0,$D53),TRUE,OFFSET(AC53,1,0,$D53))/SUMIF(OFFSET($B53,1,0,$D53),TRUE,OFFSET($K53,1,0,$D53))*$N51,2))","v":0}]
[null,null,null,null,null,null,null,null,null,null,null,{"$f":"INDEX(PO!K$12:K$145,MATCH($A56,PO!$V$12:$V$145,0))","v":"2.3."},{"$f":"INDEX(PO!N$12:N$145,MATCH($A56,PO!$V$12:$V$145,0))","v":"INSTALAÇÕES ELÉTRICAS"},{"$f":"IF(ROUND(K56,2)=0,K56,ROUND(K56,2))","v":5694.26},"Parcela (%)",{"$f":"IF($B56,0,P55-IF(ISNUMBER(O55),O55,0))","v":0},0,{"$f":"IF($B56,0,R55-IF(ISNUMBER(Q55),Q55,0))","v":0},{"$f":"IF($B56,0,S55-IF(ISNUMBER(R55),R55,0))","v":0},0,0.2,0.2,0.6,null,null,null,null,null,{"$f":"IF($B56,0,AC55-IF(ISNUMBER(AB55),AB55,0))","v":0}]
[null,null,null,null,null,null,null,null,null,null,null,null,null,null,"Acumulado (%)",{"$f":"MIN(IF($B56,P54+IF(ISNUMBER(O55),O55,0),P56/$N54),1)","v":0},{"$f":"MIN(IF($B56,Q54+IF(ISNUMBER(P55),P55,0),Q56/$N54),1)","v":0},{"$f":"MIN(IF($B56,R54+IF(ISNUMBER(Q55),Q55,0),R56/$N54),1)","v":0},{"$f":"MIN(IF($B56,S54+IF(ISNUMBER(R55),R55,0),S56/$N54),1)","v":0},{"$f":"MIN(IF($B56,T54+IF(ISNUMBER(S55),S55,0),T56/$N54),1)","v":0},{"$f":"MIN(IF($B56,U54+IF(ISNUMBER(T55),T55,0),U56/$N54),1)","v":0.2},{"$f":"MIN(IF($B56,V54+IF(ISNUMBER(U55),U55,0),V56/$N54),1)","v":0.4},{"$f":"MIN(IF($B56,W54+IF(ISNUMBER(V55),V55,0),W56/$N54),1)","v":1},null,null,null,null,null,{"$f":"MIN(IF($B56,AC54+IF(ISNUMBER(AB55),AB55,0),AC56/$N54),1)","v":0}]
[{"$f":"OFFSET(A56,-CFF.NumLinha,0)+1","v":13},{"$f":"$C56>=OFFSET($C56,CFF.NumLinha,0)","v":true},{"$f":"INDEX(PO!A$12:A$145,MATCH($A56,PO!$V$12:$V$145,0))","v":2},{"$f":"IF(ISERROR(J56),I56,SMALL(I56:J56,1))-1","v":2},{"$f":"IF($C56=1,OFFSET(E56,-CFF.NumLinha,0)+1,OFFSET(E56,-CFF.NumLinha,0))","v":2},{"$f":"IF($C56=1,0,IF($C56=2,OFFSET(F56,-CFF.NumLinha,0)+1,OFFSET(F56,-CFF.NumLinha,0)))","v":3},{"$f":"IF(AND($C56<=2,$C56<>0),0,IF($C56=3,OFFSET(G56,-CFF.NumLinha,0)+1,OFFSET(G56,-CFF.NumLinha,0)))","v":0},{"$f":"IF(AND($C56<=3,$C56<>0),0,IF($C56=4,OFFSET(H56,-CFF.NumLinha,0)+1,OFFSET(H56,-CFF.NumLinha,0)))","v":0},{"$f":"MATCH(0,OFFSET($D56,1,$C56,ROW($A$69)-ROW($A56)),0)","v":12},{"$f":"MATCH(OFFSET($D56,0,$C56)+1,OFFSET($D56,1,$C56,ROW($A$69)-ROW($A56)),0)","v":3},{"$f":"ROUND(INDEX(PO!T$12:T$145,MATCH($A56,PO!$V$12:$V$145,0)),2)+10^-12","v":5694.2600000000011},null,null,null,"Acumulado (R$)",{"$f":"IF($B56,ROUND(P55*$N54,2),ROUND(SUMIF(OFFSET($B56,1,0,$D56),TRUE,OFFSET(P56,1,0,$D56))/SUMIF(OFFSET($B56,1,0,$D56),TRUE,OFFSET($K56,1,0,$D56))*$N54,2))","v":0},0,0,0,0,1138.8499999999999,2277.6999999999998,5694.26,null,null,null,null,null,{"$f":"IF($B56,ROUND(AC55*$N54,2),ROUND(SUMIF(OFFSET($B56,1,0,$D56),TRUE,OFFSET(AC56,1,0,$D56))/SUMIF(OFFSET($B56,1,0,$D56),TRUE,OFFSET($K56,1,0,$D56))*$N54,2))","v":0}]
[null,null,null,null,null,null,null,null,null,null,null,{"$f":"INDEX(PO!K$12:K$145,MATCH($A59,PO!$V$12:$V$145,0))","v":"2.4."},{"$f":"INDEX(PO!N$12:N$145,MATCH($A59,PO!$V$12:$V$145,0))","v":"FORRO"},{"$f":"IF(ROUND(K59,2)=0,K59,ROUND(K59,2))","v":44715.96},"Parcela (%)",2.5000000000000001E-2,0,{"$f":"IF($B59,0,R58-IF(ISNUMBER(Q58),Q58,0))","v":0},{"$f":"IF($B59,0,S58-IF(ISNUMBER(R58),R58,0))","v":0},0,0.1,0.5,0.375,null,null,null,null,null,{"$f":"IF($B59,0,AC58-IF(ISNUMBER(AB58),AB58,0))","v":0}]
[null,null,null,null,null,null,null,null,null,null,null,null,null,null,"Acumulado (%)",{"$f":"MIN(IF($B59,P57+IF(ISNUMBER(O58),O58,0),P59/$N57),1)","v":2.5000000000000001E-2},{"$f":"MIN(IF($B59,Q57+IF(ISNUMBER(P58),P58,0),Q59/$N57),1)","v":2.5000000000000001E-2},{"$f":"MIN(IF($B59,R57+IF(ISNUMBER(Q58),Q58,0),R59/$N57),1)","v":2.5000000000000001E-2},{"$f":"MIN(IF($B59,S57+IF(ISNUMBER(R58),R58,0),S59/$N57),1)","v":2.5000000000000001E-2},{"$f":"MIN(IF($B59,T57+IF(ISNUMBER(S58),S58,0),T59/$N57),1)","v":2.5000000000000001E-2},{"$f":"MIN(IF($B59,U57+IF(ISNUMBER(T58),T58,0),U59/$N57),1)","v":0.125},{"$f":"MIN(IF($B59,V57+IF(ISNUMBER(U58),U58,0),V59/$N57),1)","v":0.625},{"$f":"MIN(IF($B59,W57+IF(ISNUMBER(V58),V58,0),W59/$N57),1)","v":1},null,null,null,null,null,{"$f":"MIN(IF($B59,AC57+IF(ISNUMBER(AB58),AB58,0),AC59/$N57),1)","v":0}]
[{"$f":"OFFSET(A59,-CFF.NumLinha,0)+1","v":14},{"$f":"$C59>=OFFSET($C59,CFF.NumLinha,0)","v":true},{"$f":"INDEX(PO!A$12:A$145,MATCH($A59,PO!$V$12:$V$145,0))","v":2},{"$f":"IF(ISERROR(J59),I59,SMALL(I59:J59,1))-1","v":2},{"$f":"IF($C59=1,OFFSET(E59,-CFF.NumLinha,0)+1,OFFSET(E59,-CFF.NumLinha,0))","v":2},{"$f":"IF($C59=1,0,IF($C59=2,OFFSET(F59,-CFF.NumLinha,0)+1,OFFSET(F59,-CFF.NumLinha,0)))","v":4},{"$f":"IF(AND($C59<=2,$C59<>0),0,IF($C59=3,OFFSET(G59,-CFF.NumLinha,0)+1,OFFSET(G59,-CFF.NumLinha,0)))","v":0},{"$f":"IF(AND($C59<=3,$C59<>0),0,IF($C59=4,OFFSET(H59,-CFF.NumLinha,0)+1,OFFSET(H59,-CFF.NumLinha,0)))","v":0},{"$f":"MATCH(0,OFFSET($D59,1,$C59,ROW($A$69)-ROW($A59)),0)","v":9},{"$f":"MATCH(OFFSET($D59,0,$C59)+1,OFFSET($D59,1,$C59,ROW($A$69)-ROW($A59)),0)","v":3},{"$f":"ROUND(INDEX(PO!T$12:T$145,MATCH($A59,PO!$V$12:$V$145,0)),2)+10^-12","v":44715.96},null,null,null,"Acumulado (R$)",{"$f":"IF($B59,ROUND(P58*$N57,2),ROUND(SUMIF(OFFSET($B59,1,0,$D59),TRUE,OFFSET(P59,1,0,$D59))/SUMIF(OFFSET($B59,1,0,$D59),TRUE,OFFSET($K59,1,0,$D59))*$N57,2))","v":1117.9000000000001},1117.9000000000001,1117.9000000000001,1117.9000000000001,1117.9000000000001,5589.5,27947.48,44715.96,null,null,null,null,null,{"$f":"IF($B59,ROUND(AC58*$N57,2),ROUND(SUMIF(OFFSET($B59,1,0,$D59),TRUE,OFFSET(AC59,1,0,$D59))/SUMIF(OFFSET($B59,1,0,$D59),TRUE,OFFSET($K59,1,0,$D59))*$N57,2))","v":0}]
[null,null,null,null,null,null,null,null,null,null,null,{"$f":"INDEX(PO!K$12:K$145,MATCH($A62,PO!$V$12:$V$145,0))","v":"2.5."},{"$f":"INDEX(PO!N$12:N$145,MATCH($A62,PO!$V$12:$V$145,0))","v":"REVESTIMENTOS"},{"$f":"IF(ROUND(K62,2)=0,K62,ROUND(K62,2))","v":49812.08},"Parcela (%)",null,0,null,{"$f":"IF($B62,0,S61-IF(ISNUMBER(R61),R61,0))","v":0},0,0.44,0,0.56000000000000005,null,null,null,null,null,{"$f":"IF($B62,0,AC61-IF(ISNUMBER(AB61),AB61,0))","v":0}]
[null,null,null,null,null,null,null,null,null,null,null,null,null,null,"Acumulado (%)",{"$f":"MIN(IF($B62,P60+IF(ISNUMBER(O61),O61,0),P62/$N60),1)","v":0},{"$f":"MIN(IF($B62,Q60+IF(ISNUMBER(P61),P61,0),Q62/$N60),1)","v":0},{"$f":"MIN(IF($B62,R60+IF(ISNUMBER(Q61),Q61,0),R62/$N60),1)","v":0},{"$f":"MIN(IF($B62,S60+IF(ISNUMBER(R61),R61,0),S62/$N60),1)","v":0},{"$f":"MIN(IF($B62,T60+IF(ISNUMBER(S61),S61,0),T62/$N60),1)","v":0},{"$f":"MIN(IF($B62,U60+IF(ISNUMBER(T61),T61,0),U62/$N60),1)","v":0.44},{"$f":"MIN(IF($B62,V60+IF(ISNUMBER(U61),U61,0),V62/$N60),1)","v":0.44},{"$f":"MIN(IF($B62,W60+IF(ISNUMBER(V61),V61,0),W62/$N60),1)","v":1},null,null,null,null,null,{"$f":"MIN(IF($B62,AC60+IF(ISNUMBER(AB61),AB61,0),AC62/$N60),1)","v":0}]
[{"$f":"OFFSET(A62,-CFF.NumLinha,0)+1","v":15},{"$f":"$C62>=OFFSET($C62,CFF.NumLinha,0)","v":true},{"$f":"INDEX(PO!A$12:A$145,MATCH($A62,PO!$V$12:$V$145,0))","v":2},{"$f":"IF(ISERROR(J62),I62,SMALL(I62:J62,1))-1","v":2},{"$f":"IF($C62=1,OFFSET(E62,-CFF.NumLinha,0)+1,OFFSET(E62,-CFF.NumLinha,0))","v":2},{"$f":"IF($C62=1,0,IF($C62=2,OFFSET(F62,-CFF.NumLinha,0)+1,OFFSET(F62,-CFF.NumLinha,0)))","v":5},{"$f":"IF(AND($C62<=2,$C62<>0),0,IF($C62=3,OFFSET(G62,-CFF.NumLinha,0)+1,OFFSET(G62,-CFF.NumLinha,0)))","v":0},{"$f":"IF(AND($C62<=3,$C62<>0),0,IF($C62=4,OFFSET(H62,-CFF.NumLinha,0)+1,OFFSET(H62,-CFF.NumLinha,0)))","v":0},{"$f":"MATCH(0,OFFSET($D62,1,$C62,ROW($A$69)-ROW($A62)),0)","v":6},{"$f":"MATCH(OFFSET($D62,0,$C62)+1,OFFSET($D62,1,$C62,ROW($A$69)-ROW($A62)),0)","v":3},{"$f":"ROUND(INDEX(PO!T$12:T$145,MATCH($A62,PO!$V$12:$V$145,0)),2)+10^-12","v":49812.08},null,null,null,"Acumulado (R$)",{"$f":"IF($B62,ROUND(P61*$N60,2),ROUND(SUMIF(OFFSET($B62,1,0,$D62),TRUE,OFFSET(P62,1,0,$D62))/SUMIF(OFFSET($B62,1,0,$D62),TRUE,OFFSET($K62,1,0,$D62))*$N60,2))","v":0},0,0,0,0,21917.32,21917.32,49812.08,null,null,null,null,null,{"$f":"IF($B62,ROUND(AC61*$N60,2),ROUND(SUMIF(OFFSET($B62,1,0,$D62),TRUE,OFFSET(AC62,1,0,$D62))/SUMIF(OFFSET($B62,1,0,$D62),TRUE,OFFSET($K62,1,0,$D62))*$N60,2))","v":0}]
[null,null,null,null,null,null,null,null,null,null,null,{"$f":"INDEX(PO!K$12:K$145,MATCH($A65,PO!$V$12:$V$145,0))","v":"2.6."},{"$f":"INDEX(PO!N$12:N$145,MATCH($A65,PO!$V$12:$V$145,0))","v":"PAVIMENTAÇÃO"},{"$f":"IF(ROUND(K65,2)=0,K65,ROUND(K65,2))","v":84147.38},"Parcela (%)",0,{"$f":"IF($B65,0,Q64-IF(ISNUMBER(P64),P64,0))","v":0},0.08,{"$f":"IF($B65,0,S64-IF(ISNUMBER(R64),R64,0))","v":0},0,0.25,0.25,0.42,null,null,null,null,null,{"$f":"IF($B65,0,AC64-IF(ISNUMBER(AB64),AB64,0))","v":0}]
[null,null,null,null,null,null,null,null,null,null,null,null,null,null,"Acumulado (%)",{"$f":"MIN(IF($B65,P63+IF(ISNUMBER(O64),O64,0),P65/$N63),1)","v":0},{"$f":"MIN(IF($B65,Q63+IF(ISNUMBER(P64),P64,0),Q65/$N63),1)","v":0},{"$f":"MIN(IF($B65,R63+IF(ISNUMBER(Q64),Q64,0),R65/$N63),1)","v":0.08},{"$f":"MIN(IF($B65,S63+IF(ISNUMBER(R64),R64,0),S65/$N63),1)","v":0.08},{"$f":"MIN(IF($B65,T63+IF(ISNUMBER(S64),S64,0),T65/$N63),1)","v":0.08},{"$f":"MIN(IF($B65,U63+IF(ISNUMBER(T64),T64,0),U65/$N63),1)","v":0.33},{"$f":"MIN(IF($B65,V63+IF(ISNUMBER(U64),U64,0),V65/$N63),1)","v":0.58000000000000007},{"$f":"MIN(IF($B65,W63+IF(ISNUMBER(V64),V64,0),W65/$N63),1)","v":1},null,null,null,null,null,{"$f":"MIN(IF($B65,AC63+IF(ISNUMBER(AB64),AB64,0),AC65/$N63),1)","v":0}]
[{"$f":"OFFSET(A65,-CFF.NumLinha,0)+1","v":16},{"$f":"$C65>=OFFSET($C65,CFF.NumLinha,0)","v":true},{"$f":"INDEX(PO!A$12:A$145,MATCH($A65,PO!$V$12:$V$145,0))","v":2},{"$f":"IF(ISERROR(J65),I65,SMALL(I65:J65,1))-1","v":2},{"$f":"IF($C65=1,OFFSET(E65,-CFF.NumLinha,0)+1,OFFSET(E65,-CFF.NumLinha,0))","v":2},{"$f":"IF($C65=1,0,IF($C65=2,OFFSET(F65,-CFF.NumLinha,0)+1,OFFSET(F65,-CFF.NumLinha,0)))","v":6},{"$f":"IF(AND($C65<=2,$C65<>0),0,IF($C65=3,OFFSET(G65,-CFF.NumLinha,0)+1,OFFSET(G65,-CFF.NumLinha,0)))","v":0},{"$f":"IF(AND($C65<=3,$C65<>0),0,IF($C65=4,OFFSET(H65,-CFF.NumLinha,0)+1,OFFSET(H65,-CFF.NumLinha,0)))","v":0},{"$f":"MATCH(0,OFFSET($D65,1,$C65,ROW($A$69)-ROW($A65)),0)","v":3},{"$f":"MATCH(OFFSET($D65,0,$C65)+1,OFFSET($D65,1,$C65,ROW($A$69)-ROW($A65)),0)","v":{"$error":"#N/A"}},{"$f":"ROUND(INDEX(PO!T$12:T$145,MATCH($A65,PO!$V$12:$V$145,0)),2)+10^-12","v":84147.38},null,null,null,"Acumulado (R$)",{"$f":"IF($B65,ROUND(P64*$N63,2),ROUND(SUMIF(OFFSET($B65,1,0,$D65),TRUE,OFFSET(P65,1,0,$D65))/SUMIF(OFFSET($B65,1,0,$D65),TRUE,OFFSET($K65,1,0,$D65))*$N63,2))","v":0},{"$f":"IF($B65,ROUND(Q64*$N63,2),ROUND(SUMIF(OFFSET($B65,1,0,$D65),TRUE,OFFSET(Q65,1,0,$D65))/SUMIF(OFFSET($B65,1,0,$D65),TRUE,OFFSET($K65,1,0,$D65))*$N63,2))","v":0},6731.79,6731.79,6731.79,27768.639999999999,48805.48,84147.38,null,null,null,null,null,{"$f":"IF($B65,ROUND(AC64*$N63,2),ROUND(SUMIF(OFFSET($B65,1,0,$D65),TRUE,OFFSET(AC65,1,0,$D65))/SUMIF(OFFSET($B65,1,0,$D65),TRUE,OFFSET($K65,1,0,$D65))*$N63,2))","v":0}]
[null,null,null,null,null,null,null,null,null,null,null,{"$f":"INDEX(PO!K$12:K$145,MATCH($A68,PO!$V$12:$V$145,0))","v":"3."},{"$f":"INDEX(PO!N$12:N$145,MATCH($A68,PO!$V$12:$V$145,0))","v":"LOTE 2 - FACHADA EM ACM 1ª ETAPA"},{"$f":"IF(ROUND(K68,2)=0,K68,ROUND(K68,2))","v":103430.77},"Parcela (%)",0.3,0,{"$f":"IF($B68,0,R67-IF(ISNUMBER(Q67),Q67,0))","v":0},{"$f":"IF($B68,0,S67-IF(ISNUMBER(R67),R67,0))","v":0},0,0,0,0.7,null,null,null,null,null,{"$f":"IF($B68,0,AC67-IF(ISNUMBER(AB67),AB67,0))","v":0}]
[null,null,null,null,null,null,null,null,null,null,null,null,null,null,"Acumulado (%)",{"$f":"MIN(IF($B68,P66+IF(ISNUMBER(O67),O67,0),P68/$N66),1)","v":0.3},{"$f":"MIN(IF($B68,Q66+IF(ISNUMBER(P67),P67,0),Q68/$N66),1)","v":0.3},{"$f":"MIN(IF($B68,R66+IF(ISNUMBER(Q67),Q67,0),R68/$N66),1)","v":0.3},{"$f":"MIN(IF($B68,S66+IF(ISNUMBER(R67),R67,0),S68/$N66),1)","v":0.3},{"$f":"MIN(IF($B68,T66+IF(ISNUMBER(S67),S67,0),T68/$N66),1)","v":0.3},{"$f":"MIN(IF($B68,U66+IF(ISNUMBER(T67),T67,0),U68/$N66),1)","v":0.3},{"$f":"MIN(IF($B68,V66+IF(ISNUMBER(U67),U67,0),V68/$N66),1)","v":0.3},{"$f":"MIN(IF($B68,W66+IF(ISNUMBER(V67),V67,0),W68/$N66),1)","v":1},null,null,null,null,null,{"$f":"MIN(IF($B68,AC66+IF(ISNUMBER(AB67),AB67,0),AC68/$N66),1)","v":0}]
[{"$f":"OFFSET(A68,-CFF.NumLinha,0)+1","v":17},{"$f":"$C68>=OFFSET($C68,CFF.NumLinha,0)","v":true},{"$f":"INDEX(PO!A$12:A$145,MATCH($A68,PO!$V$12:$V$145,0))","v":1},{"$f":"IF(ISERROR(J68),I68,SMALL(I68:J68,1))-1","v":0},{"$f":"IF($C68=1,OFFSET(E68,-CFF.NumLinha,0)+1,OFFSET(E68,-CFF.NumLinha,0))","v":3},{"$f":"IF($C68=1,0,IF($C68=2,OFFSET(F68,-CFF.NumLinha,0)+1,OFFSET(F68,-CFF.NumLinha,0)))","v":0},{"$f":"IF(AND($C68<=2,$C68<>0),0,IF($C68=3,OFFSET(G68,-CFF.NumLinha,0)+1,OFFSET(G68,-CFF.NumLinha,0)))","v":0},{"$f":"IF(AND($C68<=3,$C68<>0),0,IF($C68=4,OFFSET(H68,-CFF.NumLinha,0)+1,OFFSET(H68,-CFF.NumLinha,0)))","v":0},{"$f":"MATCH(0,OFFSET($D68,1,$C68,ROW($A$69)-ROW($A68)),0)","v":1},{"$f":"MATCH(OFFSET($D68,0,$C68)+1,OFFSET($D68,1,$C68,ROW($A$69)-ROW($A68)),0)","v":{"$error":"#N/A"}},{"$f":"ROUND(INDEX(PO!T$12:T$145,MATCH($A68,PO!$V$12:$V$145,0)),2)+10^-12","v":103430.77},null,null,null,"Acumulado (R$)",{"$f":"IF($B68,ROUND(P67*$N66,2),ROUND(SUMIF(OFFSET($B68,1,0,$D68),TRUE,OFFSET(P68,1,0,$D68))/SUMIF(OFFSET($B68,1,0,$D68),TRUE,OFFSET($K68,1,0,$D68))*$N66,2))","v":31029.23},{"$f":"IF($B68,ROUND(Q67*$N66,2),ROUND(SUMIF(OFFSET($B68,1,0,$D68),TRUE,OFFSET(Q68,1,0,$D68))/SUMIF(OFFSET($B68,1,0,$D68),TRUE,OFFSET($K68,1,0,$D68))*$N66,2))","v":31029.23},31029.23,31029.23,31029.23,31029.23,31029.23,103430.77,null,null,null,null,null,{"$f":"IF($B68,ROUND(AC67*$N66,2),ROUND(SUMIF(OFFSET($B68,1,0,$D68),TRUE,OFFSET(AC68,1,0,$D68))/SUMIF(OFFSET($B68,1,0,$D68),TRUE,OFFSET($K68,1,0,$D68))*$N66,2))","v":0}]
[null,null,-1,null,0,0,0,0]
[]
[null,null,null,null,null,null,null,null,null,null,null,{"$f":"DADOS!I32","v":0}]
[null,null,null,null,null,null,null,null,null,null,null,"Local"]
[]
[null,null,null,null,null,null,null,null,null,null,null,{"$f":"PO!K159","v":"2025-11-02"}]
[null,null,null,null,null,null,null,null,null,null,null,"Data"]